aboutsummaryrefslogtreecommitdiffhomepage
BranchCommit messageAuthorAge
pr/6710Update src/java.desktop/share/classes/sun/awt/util/IdentityLinkedList.javaGravatar ANUPAM DEV 24 min.
pr/67078278166: Replace RandomAccessFile with FileChannel.open + FileChannel.positio...Gravatar Brian Burkhalter 30 min.
master8277497: Last column cell in the JTAble row is read as empty cellGravatar Artem Semenov 33 min.
pr/6711removed trailing whitespaceGravatar Markus Karg 42 min.
pr/6677Review ThomasGravatar Aleksey Shipilev 47 min.
pr/6645Address review comments to consistently identify security property namesGravatar Roger Riggs 79 min.
pr/6599addressing review commentsGravatar Vicente Romero 114 min.
pr/6704Clarified that a runtime exception may be thrown by the filter factory return...Gravatar Roger Riggs 2 hours
pr/6722Addressed PR comments:Gravatar Maxim Kartashev 3 hours
pr/6718reviewGravatar Albert Yang 4 hours
pr/64818276766: Enable jar and jmod to produce deterministic timestamped contentGravatar Andrew Leonard 4 hours
pr/6724grammar in commentGravatar merykitty 4 hours
pr/6723Removing old implementation of encode_iso_array().Gravatar Patric Hedlin 5 hours
pr/5977Extensible API for JfrEpochQueueGravatar mgronlun 5 hours
pr/6607T *p to -> T* pGravatar rwestrel 5 hours
pr/6375Fix cast; add testcase to cover memory pressureGravatar Roman Kennke 6 hours
pr/6721Remove unnecessary IgnoreUnrecognizedVMOptionsGravatar Jie Fu 6 hours
pr/6717whitespacesGravatar rwestrel 6 hours
pr/6720FixGravatar Aleksey Shipilev 7 hours
pr/6594Package declarationsGravatar Aleksey Shipilev 8 hours
pr/67168253860: PPC: Relocation::pd_set_data_value conflates compressed oops and kla...Gravatar Martin Doerr 9 hours
pr/6418Merging master.Gravatar Jan Lahoda 9 hours
pr/6672newline before eofGravatar Yi Yang 10 hours
pr/6667get the correct ciklass if java.lang.Class is not resolved beforeGravatar casparcwang 11 hours
pr/66468277997: Review comments resolved.Gravatar Jatin Bhateja 13 hours
pr/6715Initial commitGravatar Hamlin-Li 15 hours
pr/6714Initial commitGravatar Hamlin-Li 15 hours
pr/6713JDK-8278273: Remove unnecessary exclusion of doclint accessibility checksGravatar Joe Darcy 18 hours
pr/6712Trailing whitespaceGravatar Alan Bateman 25 hours
pr/4961Null check added and a fix in the security test groupGravatar mbalao 44 hours
pr/6709Use isFixedOffset() instead of useDaylightTime()Gravatar Naoto Sato 47 hours
pr/6708Delete Java.gmkGravatar mrserb 3 days
pr/6600added comment for adding the ipv6_only testgroupGravatar frkator 3 days
pr/6473elease device context even if colorBits buffer can not be allocated.Gravatar Alexander Zuev 3 days
pr/6675enrich tests and do the same transformation for "long".Gravatar Zhiqiang Zang 3 days
pr/6512Merge branch 'master' of https://git.openjdk.java.net/jdk into copyclearoptGravatar Sandhya Viswanathan 3 days
pr/6703JDK-8154011: Make TraceDeoptimization a diagnostic flagGravatar Tobias Holenstein 3 days
pr/67258277628: Spec for InetAddressResolverProvider::get() throwing error or except...Gravatar Aleksei Efimov 3 days
pr/67028276125Gravatar mgronlun 3 days
pr/65298272392 Lanai: SwingSet2. Black background on expanding tree nodeGravatar Alexey Ushakov 3 days
pr/6644update commentGravatar Weijun Wang 3 days
pr/6570Change to address @albertnetymk commentGravatar Vishal Chand 3 days
pr/5179Fixed indentationGravatar Markus Karg 3 days
pr/6700Initial commitGravatar Alan Bateman 3 days
pr/66998278031Gravatar mgronlun 3 days
pr/6698full-gc-compact-assertGravatar Albert Yang 3 days
pr/6697whitespaceGravatar rwestrel 3 days
pr/66968278205: jlink plugins should dump .class file in debug modeGravatar Sundararajan Athijegannathan 3 days
pr/65388277497: Last column cell in the JTAble row is read as empty cellGravatar Artem Semenov 3 days
pr/6670use direct bailoutGravatar Christian Hagedorn 3 days
pr/6671Tidy up the commentGravatar Aleksey Shipilev 3 days
pr/66948247973: Javadoc incorrect for IdentityArrayList, IdentityLinkedListGravatar ANUPAM DEV 3 days
pr/66938278185: Custom JRE cannot find non-ASCII named module insideGravatar Toshio Nakamura 3 days
pr/6661Add waitForIdleGravatar Prasanta Sadhukhan 3 days
pr/66268277353: java/security/MessageDigest/ThreadSafetyTest.java test times outGravatar Sibabrata Sahoo 4 days
pr/6689Don't run jstack until after all target process threads are done starting up.Gravatar Chris Plummer 4 days
pr/6441include the same optimization for SubLNode::Ideal and add associated tests.Gravatar Zhiqiang Zang 4 days
pr/6548adding support for type annotationsGravatar Vicente Romero 4 days
pr/6688JDK-8278179: Enable all doclint warnings for build of java.namingGravatar Joe Darcy 4 days
pr/6206minor changes to the benchmarkGravatar vamsi-parasa 4 days
pr/6687JDK-8278175: Enable all doclint warnings for build of java.desktopGravatar Joe Darcy 4 days
pr/6685JDK-8272944: Use snippets in jdk.javadoc documentationGravatar Jonathan Gibbons 4 days
pr/6686JDK-8272945: Use snippets in java.compiler documentationGravatar Jonathan Gibbons 4 days
pr/66848278174: runtime/cds/appcds/LambdaWithJavaAgent.java fails with release VMsGravatar Jie Fu 4 days
pr/66838271202: C1: assert(false) failed: live_in set of first block must be emptyGravatar Martin Doerr 4 days
pr/66828251400: Fix incorrect addition of library to test in JDK-8237858Gravatar Magnus Ihse Bursie 4 days
pr/66818278172: java/nio/channels/FileChannel/BlockDeviceSize.java should only run o...Gravatar Brian Burkhalter 4 days
pr/6634revert intrinsicsGravatar merykitty 4 days
pr/66808278163: --with-cacerts-src variable resolved after GenerateCacerts recipe setupGravatar Andrew Leonard 4 days
pr/6679Initial commitGravatar Pavel Rappo 4 days
pr/6374removed robot mouse moves, use pixel colors to checkGravatar Alisen Chung 4 days
pr/66788276241: JVM does not flag constant class entries ending in '/'Gravatar Harold Seigel 4 days
pr/6493Update symbol files to JDK 18 b26.Gravatar Joe Darcy 4 days
pr/6640tstuefe's commentsGravatar Zhengyu Gu 4 days
pr/6657Appease jcheck.Gravatar Joe Darcy 4 days
pr/64358276661: s/\!forceLongPrefix/allowShortPath/Gravatar Brian Burkhalter 4 days
pr/6676Increase test timeout from 240 to 480Gravatar Chris Plummer 4 days
pr/6674initial commitGravatar Julia Boes 4 days
pr/6673Allow user to override reproducible building of zip fileGravatar Magnus Ihse Bursie 4 days
pr/6320PPC port by @TheRealMDoerrGravatar Roman Kennke 4 days
pr/6642aded copyright notice and method reference testGravatar Adam Sotona 4 days
pr/6668Add missing @throws tagsGravatar Maurizio Cimadamore 4 days
pr/66478278080: Add --with-cacerts-src='user cacerts folder' to enable deterministic...Gravatar Andrew Leonard 4 days
pr/6669FixGravatar Aleksey Shipilev 4 days
pr/6665FixGravatar Aleksey Shipilev 4 days
pr/6334Fix up UseROPProtection flagGravatar Alan Hayward 4 days
pr/66638278119: ProblemList few headful test failing in macosx12-aarch64 systemGravatar Prasanta Sadhukhan 4 days
pr/6660FixGravatar Aleksey Shipilev 4 days
pr/6659FixGravatar Aleksey Shipilev 4 days
pr/6641Add test with an odd number of argumentsGravatar Danil Bubnov 4 days
pr/6603Add uninstallColorsAndFontGravatar Liam Miller-Cushon 4 days
pr/66628268575: Annotations not visible on model elements before they are generatedGravatar Srikanth Adayapalam 5 days
pr/6443Merge branch 'master' into JDK-8276674Gravatar Tim Prinzing 5 days
pr/6627Merge branch 'master' into parallelize-evac-failureGravatar Hamlin Li 5 days
pr/66568278099: two sun/security/pkcs11/Signature tests failed with AssertionErrorGravatar Valerie Peng 5 days
pr/6595MICRO to MILLI as requested.Gravatar Scott Gibbons 5 days
pr/6654JDK-8276837: [macos]: Error when signing the additional launcherGravatar Andy Herrick 5 days
pr/66558255409: Support the new APIs in PKCS#11 v3.0Gravatar Valerie Peng 5 days
pr/66538275731: CDS archived enums objects are recreated at runtimeGravatar iklam 5 days
pr/6465Merge branch 'master' into 8276447Gravatar bchristi 5 days
pr/66518268288: jdk/jfr/api/consumer/streaming/TestOutOfProcessMigration.java fails ...Gravatar Calvin Cheung 5 days
pr/66508266839: Enable pandoc on macosx-aarch64Gravatar Mikael Vidstedt 5 days
pr/6630copyrightGravatar Albert Yang 5 days
pr/6513Update for address review commentsGravatar Valerie Peng 5 days
pr/6648Patch for JDK-8277422Gravatar Lance Andersen 5 days
pr/6353Merge branch 'master' into 8273056Gravatar JimLaskey 5 days
pr/6625missing ")"Gravatar aoqi 5 days
pr/6666block_at_or_precedingGravatar Albert Yang 5 days
pr/66438255266: 2021-11-27 public suffix list update v 3c213aaGravatar Weijun Wang 5 days
pr/66398278079: C2: expand_dtrace_alloc_probe doesn't take effect in macro.cppGravatar denghui.ddh 5 days
pr/65428277762: Allow configuration of HOTSPOT_BUILD_USERGravatar Andrew Leonard 5 days
pr/66388278028: [test-library] Warnings cleanup of the test libraryGravatar Roger Riggs 5 days
pr/66378278065: Refactor subclassAudits to use ClassValueGravatar Roman Kennke 5 days
pr/6636JDK-8276837: [macos]: Errorwhen signing the additional launcherGravatar Andy Herrick 5 days
pr/6635Fix typos in MemorySegment dereference settersGravatar Maurizio Cimadamore 5 days
pr/6614changed if statement styleGravatar Ludvig Janiuk 5 days
pr/6605Thomas reviewGravatar Hamlin-Li 5 days
pr/6633ensure all fallback components are usedGravatar Dmitry Batrak 5 days
pr/6632testGravatar rwestrel 5 days
pr/5488Fix jit/t/t105/t105.java to also use -XX:-OptimizeImplicitExceptions in addit...Gravatar Volker Simonis 5 days
pr/66298277619: AArch64: Incorrect parameter type in Advanced SIMD Copy assembler fu...Gravatar Faye Gao 5 days
pr/65448277793: Review comments resolution.Gravatar Jatin Bhateja 6 days
pr/5522Change in test case name from GZipLoopTest.java to CloseDeflaterTest , moved ...Gravatar rreddy 6 days
pr/6561Albert reviewGravatar Hamlin-Li 6 days
pr/6026final spec changeGravatar Weijun Wang 6 days
pr/6621Update copywrite year.Gravatar Paul Sandoz 6 days
pr/6589Simplify FunctionDescriptor::insertArgumentLayoutsGravatar Maurizio Cimadamore 6 days
pr/6620s/equals/isEmptyGravatar JoeWang-Java 6 days
pr/6623Better test and clean upGravatar Pavel Rappo 6 days
pr/6622Filter out tier1/2 groups tooGravatar Aleksey Shipilev 6 days
pr/6619FixGravatar Aleksey Shipilev 6 days
pr/6602review feedbackGravatar Jonathan Gibbons 6 days
pr/6649Remove entryNameGravatar stsypanov 6 days
pr/6215Add a statement to clarify the space of the propertiesGravatar JoeWang-Java 6 days
pr/6484remove the unused stream parameter in ClassLoaderExt::record_result()Gravatar Calvin Cheung 6 days
pr/6618v0Gravatar Zhengyu Gu 6 days
pr/6616Initial commitGravatar Alan Bateman 6 days
pr/66158277986: Typo in javadoc of java.util.zip.ZipEntry#setTimeGravatar jpai 6 days
pr/66178277985: G1: Compare max_parallel_refinement_threads to UINT_MAXGravatar Leo Korinth 6 days
pr/6613FixGravatar Aleksey Shipilev 6 days
pr/66118277194Gravatar mgronlun 6 days
pr/66128277757: Parallelize humongous reclaimGravatar Stefan Johansson 6 days
pr/6591Merge branch 'openjdk:master' into JDK-8277930Gravatar xpbob 6 days
pr/5848Merge branch 'master' into JDK-8274903-zero-asyncgetcalltraceGravatar Aleksey Shipilev 6 days
pr/66108264485: build.tools.depend.Depend.toString(byte[]) creates malformed hex str...Gravatar Adam Sotona 6 days
pr/66098277977: Incorrect references to --enable-reproducible-builds in docsGravatar Maxim Kartashev 6 days
pr/66086465404: some problems in CellEditor related API docsGravatar TejeshR13 6 days
pr/6554JDK-8277822-Remove-debug-only-heap-overrun-checks-in-os-malloc-and-friendsGravatar tstuefe 6 days
pr/66068265150: AsyncGetCallTrace crashes on ResourceMarkGravatar Coleen Phillimore 7 days
pr/66048277965: Enclosing instance optimization affects serializationGravatar Liam Miller-Cushon 7 days
pr/6598Changed to not skipping the test in DateFormatTest.javaGravatar Naoto Sato 7 days
pr/6601vmTestbase/nsk/jdi/TypeComponent/isSynthetic/issynthetic001 fails with "Synth...Gravatar Liam Miller-Cushon 7 days
pr/6445Fix the whitespace issue of the microbenchmark.Gravatar Xin Liu 7 days
pr/3938JDK-8266431: Dual-Pivot Quicksort improvements (Radix sort)Gravatar Vladimir Yaroslavskiy 7 days
pr/65978277948: AArch64: Print the correct stack if -XX:+PreserveFramePointer when c...Gravatar denghui.ddh 7 days
pr/6497Merge branch 'master' into jwebserverGravatar Julia Boes 7 days
pr/67018275610: C2: Object field load floats above its null check resulting in a seg...Gravatar Christian Hagedorn 7 days
pr/6719Fixing test.Gravatar Jan Lahoda 7 days
pr/6579Normalize newlines on detail messageGravatar Hannes Wallnoefer 7 days
pr/66288251216: Implement MD5 intrinsics on AArch64Gravatar Patric Hedlin 7 days
pr/6593trivialGravatar Albert Yang 7 days
pr/6590Fix format specifierGravatar Thomas Schatzl 7 days
pr/6276Remove igvn checksGravatar Christian Hagedorn 7 days
pr/6555reviewGravatar Albert Yang 7 days
pr/6576test fixGravatar rwestrel 7 days
pr/65858276985: AArch64: [vectorapi] Backend support of VectorMaskToLongNodeGravatar Eric Liu 7 days
pr/65758277868: Use Integer.signum() in BasicTableUIGravatar Sergey Tsypanov 7 days
pr/66958277864: Compilation error thrown while doing a boxing conversion on selector...Gravatar Jan Lahoda 7 days
pr/54828274640: Cleanup unnecessary null comparison before instanceof check in java....Gravatar Andrey Turbanov 7 days
pr/6587typoGravatar Hamlin-Li 7 days
pr/6583Add bug IDGravatar Daniel Jelinski 7 days
pr/6527Refined wording. Removed `LENIENT` parser. Added tests for CI.Gravatar Naoto Sato 8 days
pr/6586ps-virtual-initGravatar Albert Yang 8 days
pr/6582remove test from problemlistGravatar Kim Barrett 9 days
pr/6584trivialGravatar Albert Yang 9 days
pr/6379Creating temp files in current working directoryGravatar Markus Karg 9 days
pr/65818277878: Fix compiler tests after JDK-8275908Gravatar Volker Simonis 9 days
pr/6568JDK-8277795: whitespaceGravatar robm 10 days
pr/6567Review commentGravatar Ivan Walulya 10 days
pr/6452JDK-8277383-VM-metaspace-optionally-show-chunk-freelist-detailsGravatar tstuefe 10 days
pr/6588ref_countGravatar Albert Yang 10 days
pr/65778277865: G1: Change integer division to floating point divisionGravatar Leo Korinth 10 days
pr/5076Merge branch 'master' into ap-keep-originating-elementsGravatar Jan Lahoda 10 days
pr/65748277866: gc/epsilon/TestMemoryMXBeans.java failed with wrong initial heap sizeGravatar KIRIYAMA Takuya 10 days
pr/6541Fix Decompile.java test for non-JVMCI buildsGravatar Volker Simonis 10 days
pr/6573InitialGravatar Erik Gahlin 10 days
pr/6572make test runnable with release buildGravatar rwestrel 10 days
pr/65718277860: PPC: Remove duplicate info != NULL checkGravatar Roman Kennke 10 days
pr/6564Clean upGravatar Nils Eliasson 10 days
pr/6526Remove verify_raw_mem()Gravatar Roman Kennke 10 days
pr/6562Address review commentsGravatar Jie Fu 10 days
pr/65698277854: The upper bound of GCCardSizeInBytes should be limited to 512 for 32...Gravatar Jie Fu 10 days
pr/6522Fix after mergeGravatar Jorn Vernee 11 days
pr/6429Merge branch 'master' into JDK-8275330Gravatar rwestrel 11 days
pr/6566initial commitGravatar Julia Boes 11 days
pr/6565Enable new ASCII node.Gravatar Martin Doerr 11 days
pr/65788277328: jdk/jshell/CommandCompletionTest.java failures on WindowsGravatar Jan Lahoda 11 days
pr/65638277842: IGV: Add jvms property to know where a node came fromGravatar Christian Hagedorn 11 days
pr/65608277659: [TESTBUG] ThreadOnSpinWaitProducerConsumer hangsGravatar Stuart Monteith 11 days
pr/65566462028:MaskFormatter API documentation refers to getDisplayValueGravatar TejeshR13 11 days
pr/6557remove_unusedGravatar Albert Yang 11 days
pr/65528267767: Redundant condition check in SafepointSynchronize::thread_not_runningGravatar David Holmes 11 days
pr/6549update copyrightGravatar Kim Barrett 12 days
pr/6550log refinement rateGravatar Kim Barrett 12 days
pr/6514Albert reviewGravatar Hamlin-Li 12 days
pr/6551move thread active logging inside stsGravatar Kim Barrett 12 days
pr/65458277155: Compress and expand vector operationsGravatar Paul Sandoz 12 days
pr/6530minor fix to avoid castingGravatar Mandy Chung 12 days
pr/65438270435: UT: MonitorUsedDeflationThresholdTest failed: did not find too_many ...Gravatar Daniel D. Daugherty 12 days
pr/6394last one nowGravatar Ludvig Janiuk 12 days
pr/6397Remove unrelated commentGravatar Pavel Rappo 12 days
pr/6409Made forkOrInvoke() method protected to avoid strange compiler errorGravatar Dr Heinz M. Kabutz 12 days
pr/5486review suggestion - format code in ModuleInfoEntry to use 4 space indentationGravatar jpai 12 days
pr/6537removed obsolete part of the testGravatar Adam Sotona 12 days
pr/6456indentation error fixedGravatar Ludvig Janiuk 12 days
pr/65368275687: runtime/CommandLine/PrintTouchedMethods test shouldn't catch Runtime...Gravatar fmatte 12 days
pr/65358277777: [Vector API] assert(r->is_XMMRegister()) failed: must be in x86_32.adGravatar Jie Fu 12 days
pr/61518262297: ImageIO.write() method will throw IndexOutOfBoundsExceptionGravatar Yano, Masanori 12 days
pr/6447add check bmiGravatar MeryKitty 12 days
pr/6533x86_32: multiple fastdebug failures with "bad AD file"Gravatar Jie Fu 12 days
pr/65348277647: [REDO] JDK-8277507 Add jlink.debug system property while launching j...Gravatar jpai 12 days
pr/6520dholmes review commentsGravatar Erik Österlund 12 days
pr/6532Also test cme for identity hash mapGravatar liach 13 days
pr/64758277398: javac does not accept encoding name COMPATGravatar takiguc 13 days
pr/65058274784: jshell: Garbled character was displayed by System.out.println(...) o...Gravatar takiguc 13 days
pr/6540v0Gravatar Zhengyu Gu 13 days
pr/6082some word changesGravatar Weijun Wang 13 days
pr/6531JDK-8277375: jdeps errors on a class path with a file path with no permissionGravatar Mandy Chung 13 days
pr/6539initialGravatar Ivan Walulya 13 days
pr/58178274893: Update java.desktop classes to use try-with-resourcesGravatar Andrey Turbanov 13 days
pr/6212Clean-up address calculation via use of legitimize_address().Gravatar Patric Hedlin 13 days
pr/65258277652: SIGSEGV in ShenandoahBarrierC2Support::verify_raw_mem for malformed ...Gravatar Jie Fu 13 days
pr/4966Restore accidentally removed flag from BridgeMethodsForLambdaTestGravatar Liam Miller-Cushon 13 days
pr/65218277503: compiler/onSpinWait/TestOnSpinWaitAArch64DefaultFlags.java failed wi...Gravatar Evgeny Astigeevich 13 days
pr/6519Added "Found Roots" metric to Scan Heap Roots loggingGravatar Thomas Schatzl 13 days
pr/6524JDK-8248863: Add feature to trigger search via URI fragmentGravatar Hannes Wallnoefer 13 days
pr/65188266435: WBMPImageReader.read() should not truncate the input streamGravatar jayathirthrao 13 days
pr/63958276764: Enable deterministic file content ordering for Jar and JmodGravatar Andrew Leonard 13 days
pr/6515mergeGravatar lmesnik 13 days
pr/6403fixing typos and adding a commentGravatar Vicente Romero 14 days
pr/6511fix: copy `hashIsZero` in `String#String(String)`Gravatar Petr Portnov 14 days
pr/65108277350: runtime/jni/checked/TestPrimitiveArrayCriticalWithBadParam.java time...Gravatar Daniel D. Daugherty 14 days
pr/6490Improve the exception message when the type is not availableGravatar Mandy Chung 14 days
pr/65088277322: Document that setting an invalid property `jdk.serialFilter` disable...Gravatar Roger Riggs 14 days
pr/6455Re-grouped UI creation code for clarityGravatar Alexey Ivanov 14 days
pr/65078277578: ProblemList applications/jcstress/acqrel.java on linux-aarch64Gravatar Daniel D. Daugherty 14 days
pr/6494Reflow paragraphs.Gravatar Joe Darcy 2 weeks
pr/6506JDK-8268582: javadoc throws NPE with JDK 11Gravatar Hannes Wallnoefer 2 weeks
pr/6502reviewGravatar Albert Yang 2 weeks
pr/6504Unnecessary checkGravatar Zhengyu Gu 2 weeks
pr/6517Remove dead code swap_suxGravatar Ludvig Janiuk 2 weeks
pr/65018276696: ParallelObjectIterator freed at the wrong time in VM_HeapDumperGravatar Erik Österlund 2 weeks
pr/65038277441: CompileQueue::add fails with assert(_last->next() == __null) failed:...Gravatar Tobias Hartmann 2 weeks
pr/5907Merge branch 'master' into JEP-419Gravatar Maurizio Cimadamore 2 weeks
pr/6499Initial commitGravatar Hamlin-Li 2 weeks
pr/57148277535: Remove redundant Stream.distinct()/sorted() stepsGravatar Andrey Turbanov 2 weeks
pr/6500set_processing_is_mtGravatar Albert Yang 2 weeks
pr/64988277411: C2 fast_unlock intrinsic on AArch64 has unnecessary ownership checkGravatar Erik Österlund 2 weeks
pr/64958277531: Print actual default stacksize on Windows thread loggingGravatar KIRIYAMA Takuya 2 weeks
pr/63648277042: add test for 8276036 to compiler/codecacheGravatar KIRIYAMA Takuya 2 weeks
pr/6478fixedGravatar lmesnik 2 weeks
pr/6470Stefan reviewGravatar Hamlin-Li 2 weeks
pr/64928277508: need to check has_predicated_vectors before calling scalable_predica...Gravatar yadongw 2 weeks
pr/64918277507: Add jlink.debug system property while launching jpackage tests to he...Gravatar jpai 2 weeks
pr/64318277239: Review comments resolution.Gravatar Jatin Bhateja 2 weeks
pr/6496trivialGravatar Albert Yang 2 weeks
pr/6489relax exception message checkGravatar Dean Long 2 weeks
pr/64888003417: WeakHashMap$HashIterator removes wrong entryGravatar jpai 2 weeks
pr/64858277429: Conflicting jpackage static library nameGravatar Alexey Semenyuk 2 weeks
pr/6482Update the SipHash copyright to match current sources.Gravatar Coleen Phillimore 2 weeks
pr/6480Added comment explaining why immutable Maps are not 'ValueBased'Gravatar Roger Riggs 2 weeks
pr/6483Revert "8276150: Quarantined jpackage apps are labeled as "damaged""Gravatar Daniel D. Daugherty 2 weeks
pr/62278176501: Method Shape.getBounds2D() incorrectly includes Bezier control point...Gravatar jeremy 2 weeks
pr/6400Add motivating comment for THREAD_LOCALGravatar Derek White 2 weeks
pr/6464Fix null-check on PPCGravatar Roman Kennke 2 weeks
pr/64798277485: Zero: fix fast bytecodes implementationGravatar Jie Fu 2 weeks
pr/6359Address feedbackGravatar Pavel Rappo 2 weeks
pr/5952Volker Feedback 2Gravatar tstuefe 2 weeks
pr/6280Delete has_byte_register().Gravatar theRealAph 2 weeks
pr/5838Changes to address @albertnetymk commentsGravatar Vishal Chand 2 weeks
pr/6408More review feedbackGravatar Daniel Fuchs 2 weeks
pr/64768277449: compiler/vectorapi/TestLongVectorNeg.java fails with release VMsGravatar Jie Fu 2 weeks
pr/6306do you run FreeTypeScalerJNICheck.java test on WindowsGravatar MBaesken 2 weeks
pr/6454Rename ZThreadEvent to ZThreadDebugGravatar Stefan Karlsson 2 weeks
pr/6474Initial commitGravatar Hamlin-Li 2 weeks
pr/6289Merge with masterGravatar Hamlin-Li 3 weeks
pr/6466Fix comments.Gravatar Coleen Phillimore 3 weeks
pr/6468Update jib-profiles to use JMH 1.33 devkitGravatar Claes Redestad 3 weeks
pr/6446Use $GREP to check /proc/interruptsGravatar Yasumasa Suenaga 3 weeks
pr/6467refactor to dump hidden classes consistentlyGravatar Dean Long 3 weeks
pr/6442Remove Finalizer.Holder class.Gravatar Stuart Marks 3 weeks
pr/64638277404: Test VMDeprecatedOptions.java failing with Unable to create shared a...Gravatar Harold Seigel 3 weeks
pr/6462JDK-8264297: Create implementation for NSAccessibilityProgressIndicator proto...Gravatar Alexander Zuev 3 weeks
pr/5038Merge pull request #7 from lahodaj/JDK-8224922-5Gravatar Joe Darcy 3 weeks
pr/6325Remove debug clobber codeGravatar I517973 3 weeks
pr/6393Merge branch '8276665-readfields-cnfe' of https://github.com/RogerRiggs/jdk i...Gravatar Roger Riggs 3 weeks
pr/6450Review ColeenGravatar Stefan Karlsson 3 weeks
pr/6457Review PerGravatar Stefan Karlsson 3 weeks
pr/6095JDK-8276939: Fix AbstractLdapNamingEnumeration next to throw NoSuchElementExc...Gravatar andrewluotechnologies 3 weeks
pr/6459FixGravatar Aleksey Shipilev 3 weeks
pr/6453safepoint_workersGravatar Albert Yang 3 weeks
pr/6451JDK-8277092-TestMetaspaceAllocationMT2-java-ndebug-default-Committed-seems-hi...Gravatar tstuefe 3 weeks
pr/6413update AlwaysIncrementalInline and assertGravatar Christian Hagedorn 3 weeks
pr/6440get rid of the checks in jvmti handshakes: java_thread->threadObj() == NULLGravatar Serguei Spitsyn 3 weeks
pr/64498277213: CompileTask_lock is acquired out of order with MethodCompileQueue_lockGravatar Tobias Hartmann 3 weeks
pr/6436[PATCH] Use String.stripTrailing instead of hand-crafted method in SwingUtili...Gravatar Andrey Turbanov 3 weeks
pr/6402force GC to clean weak referencesGravatar lmesnik 3 weeks
pr/64448277168: AArch64: Enable arraycopy partial inlining with SVEGravatar Pengfei Li 3 weeks
pr/6072Merge branch 'master' of https://git.openjdk.java.net/jdk into sve_compareto_...Gravatar TatWai Chong 3 weeks
pr/6404update to handle methods on JavaFileManager, such as getFileForInputGravatar Jonathan Gibbons 3 weeks
pr/6448ref_processor_initGravatar Albert Yang 3 weeks
pr/6430parameter namesGravatar Thomas Schatzl 3 weeks
pr/64378277343: dynamicArchive/SharedArchiveFileOption.java failed: '-XX:+RecordDyna...Gravatar iklam 3 weeks
pr/5943[PATCH] Change nested classes in java.desktop to static nested classesGravatar Andrey Turbanov 3 weeks
pr/6282Removed changes to Util.java as it is not needed.Gravatar Naoto Sato 3 weeks
pr/6433test updateGravatar Seán Coffey 3 weeks
pr/6421Fixed parameters layout for better readeability;Gravatar Alexander Zuev 3 weeks
pr/64348276216: Negated character classes performance regression in PatternGravatar Volker Simonis 3 weeks
pr/6416check either KU_SIGNATURE or KU_NON_REPUDIATIONGravatar Weijun Wang 3 weeks
pr/6399remove bug idGravatar Alex Kashchenko 3 weeks
pr/6427Use expandGravatar Tobias Hartmann 3 weeks
pr/6415Set defaults for OnSpinWaitInst/OnSpinWaitInstCount independentlyGravatar Evgeny Astigeevich 3 weeks
pr/6432safepoint_workers_commentGravatar Albert Yang 3 weeks
pr/64288275643: C2's unaryOp vector intrinsic does not properly handle LongVector.negGravatar Tobias Hartmann 3 weeks
pr/6406use increment macroGravatar Erik Österlund 3 weeks
pr/6425JDK-8277303: Terminology mismatch between JLS17-3.9 and SE17's javax.lang.mod...Gravatar Joe Darcy 3 weeks
pr/6426use stack buffer instead of static bufferGravatar Dean Long 3 weeks
pr/64248277313: Validate header failed for test/jdk/java/net/httpclient/HeadTest.javaGravatar fmatte 3 weeks
pr/6115Regenerate the asmtest.out.h file for aarch64 after rebasingGravatar Fei Gao 3 weeks
pr/6423actually resolve @cpi referencesGravatar Dean Long 3 weeks
pr/64228275071: [macos] A11y cursor gets stuck when combobox is closedGravatar Alexander Zuev 3 weeks
pr/64198275037: Test vmTestbase/nsk/sysdict/vm/stress/btree/btree011/btree011.java c...Gravatar Harold Seigel 3 weeks
pr/6401Refined PrintStream::charset()'s method description, and moved it down along ...Gravatar Naoto Sato 3 weeks
pr/6275Refactored empty stream implementations to reduce duplicate code and improved...Gravatar Dr Heinz M. Kabutz 3 weeks
pr/5098Merge branch 'master' into JDK-8272358Gravatar mrserb 3 weeks
pr/6186Merge branch 'master' into JDK-8169468Gravatar Alexander Zuev 3 weeks
pr/6383Merge branch 'master' into 8276787-improve-RecordDynamicDumpInfo-messagesGravatar iklam 3 weeks
pr/6296Use var in for loop in SignerInfo.Gravatar Sean Mullan 3 weeks
pr/64178277106: Cannot compile certain sources with --releaseGravatar Jan Lahoda 3 weeks
pr/6390Add (Deprecated) to comments and add options to deprecated testGravatar Harold Seigel 3 weeks
pr/6414trivialGravatar Albert Yang 3 weeks
pr/6412ref-ctorGravatar Albert Yang 3 weeks
pr/6391Update commentsGravatar Dr Heinz M. Kabutz 3 weeks
pr/64078277178: Reduce the priority of data dependent nodes when OptoScheduling enabledGravatar sunguoyun 3 weeks
pr/2289return bool for ColeenGravatar Erik Österlund 3 weeks
pr/6363Remove changes to GetDiagnosticCommandInfoGravatar tstuefe 3 weeks
pr/63868277102 Dubious PrintCompilation outputGravatar Yi Yang 3 weeks
pr/64108276177: nsk/jvmti/RedefineClasses/StressRedefineWithoutBytecodeCorruption fa...Gravatar Coleen Phillimore 3 weeks
pr/6380Update EmptyComment.javaGravatar mrserb 3 weeks
pr/6392Improve writeReplace methods to better describe what object is returned.Gravatar Sean Mullan 3 weeks
pr/6398link class so that find_cached_constant_at does not crashGravatar Dean Long 3 weeks
pr/34024511638: Double.toString(double) sometimes produces incorrect resultsGravatar Raffaello Giulietti 3 weeks
pr/6396 JDKJDK-8276150: Quarantined jpackage apps are labeled as "damaged"Gravatar Andy Herrick 3 weeks
pr/6205update per comments from Ioi and DavidGravatar Calvin Cheung 3 weeks
pr/64058266368: Inaccurate after_unwind hook in C2 exception handlerGravatar Erik Österlund 3 weeks
pr/6346Use MACOSX_VERSION_MIN for aarch64Gravatar jayathirthrao 3 weeks
pr/6378RefactoringGravatar Yasumasa Suenaga 3 weeks
pr/63898227020: Unclosed input streams in URL Class Loader for JARs with META-INF/IN...Gravatar jpai 3 weeks
pr/6387JDK-8277028: Use service type documentation as fallback for @providesGravatar Hannes Wallnoefer 3 weeks
pr/6388Initial commitGravatar Hamlin-Li 3 weeks
pr/6059ayang review3Gravatar Thomas Schatzl 3 weeks
pr/6384remove commentGravatar tstuefe 3 weeks
pr/6362Remove completelyGravatar Hamlin-Li 3 weeks
pr/6327reviewGravatar Albert Yang 3 weeks
pr/6377Rename LIR_OprDesc to LIR_OprGravatar Man Cao 3 weeks
pr/6344strengthen version checkGravatar Dean Long 3 weeks
pr/6221Merge branch 'master' into JDK8276453Gravatar Man Cao 3 weeks
pr/6373[PATCH] Remove redundant synchronized from URLStreamHandler.openConnection me...Gravatar Andrey Turbanov 3 weeks
pr/6372[PATCH] Use String.isBlank to simplify codeGravatar Andrey Turbanov 3 weeks
pr/6101add tests cover constant comparison and calling libraryGravatar MeryKitty 3 weeks
pr/63698277059: Use blessed modifier order in java.xmlGravatar Magnus Ihse Bursie 3 weeks
pr/6343Merge masterGravatar Coleen Phillimore 3 weeks
pr/6367Initial commitGravatar Pavel Rappo 3 weeks
pr/5937Implemented the review comments.Gravatar Mahendra Chhipa 3 weeks
pr/6348Implement Daniel's review suggestion - use a different URI for HEAD() request...Gravatar jpai 3 weeks
pr/6366remove_set_concurrencyGravatar Albert Yang 3 weeks
pr/6361add jtreg bug idGravatar Julia Boes 3 weeks
pr/6365[PATCH] Use String.stripTrailing() in jdk.jshell where applicableGravatar Andrey Turbanov 3 weeks
pr/6323[PATCH] Use String.isBlank in jdk.javadocGravatar Andrey Turbanov 3 weeks
pr/63118276743: Make openjdk build Zip Archive generation "reproducible"Gravatar Andrew Leonard 3 weeks
pr/6360tweak initialiationGravatar Lance Andersen 4 weeks
pr/5873Merge branch 'master' into JDK-8271515-vector-apiGravatar Paul Sandoz 4 weeks
pr/6342Address minor review commentsGravatar Lance Andersen 4 weeks
pr/1498Make gensrc code use $COPYRIGHT_YEARGravatar Magnus Ihse Bursie 4 weeks
pr/63578277016: Use blessed modifier order in httpserverGravatar Magnus Ihse Bursie 4 weeks
pr/63558277015: Use blessed modifier order in Panama codeGravatar Magnus Ihse Bursie 4 weeks
pr/63548277012: Use blessed modifier order in src/utilsGravatar Magnus Ihse Bursie 4 weeks
pr/6351Bump timeout for tests that don't expect SocketTimeoutExceptionGravatar Alan Bateman 4 weeks
pr/63528273792 - JumpableGenerator.rngs() documentation refers to wrong methodGravatar JimLaskey 4 weeks
pr/6336Add _is_running initialization.Gravatar Coleen Phillimore 4 weeks
pr/63498274685: Documentation suggests there are ArbitrarilyJumpableGenerator when noneGravatar JimLaskey 4 weeks
pr/6350Error in javac caused by switch expression without result expressions: Intern...Gravatar Guoxiong Li 4 weeks
pr/63588275329: ZGC: vmTestbase/gc/gctests/SoftReference/soft004/soft004.java fails ...Gravatar Per Liden 4 weeks
pr/6333Removed unnecessary inline compile commandGravatar Tobias Hartmann 4 weeks
pr/55628275728: Add simple Producer/Consumer microbenchmark for Thread.onSpinWaitGravatar Evgeny Astigeevich 4 weeks
pr/6347Small fixes to DumpAllocStat::print_statsGravatar tstuefe 4 weeks
pr/6345BugfixGravatar Alexey Semenyuk 4 weeks
pr/6099Add some commentGravatar casparcwang 4 weeks
pr/6258Using @code tag for `Set`.Gravatar Naoto Sato 4 weeks
pr/6339Update WindowResizingOnMovingToAnotherDisplay.javaGravatar mrserb 4 weeks
pr/63378276904: Optional.toString() is unnecessarily expensiveGravatar Éamonn McManus 4 weeks
pr/6291remove ids, reintroduce two tbodiesGravatar Ludvig Janiuk 4 weeks
pr/6316Reverted wrong methodGravatar Zhengyu Gu 4 weeks
pr/6173Moved declaration and added a commentGravatar Hannes Wallnoefer 4 weeks
pr/63388275728: Add simple Producer/Consumer microbenchmark for Thread.onSpinWaitGravatar Evgeny Astigeevich 4 weeks
pr/5900Improve l10n hintGravatar Hannes Wallnoefer 4 weeks
pr/5822Merge branch 'master' into JDK-8244202_JEP418_implGravatar Aleksei Efimov 4 weeks
pr/5849Changes based on Ralf's feedback.Gravatar Richard Reingruber 4 weeks
pr/6335Clarify how DateTimeFormatterBuilder.appendFraction handles value rangesGravatar Claes Redestad 4 weeks
pr/5955Merge branch 'master' into optimize-fwdptrGravatar Roman Kennke 4 weeks
pr/6076Added extra info to Cleaner comment.Gravatar Hendrik Schreiber 4 weeks
pr/6310Merge branch 'master' into JDK-8276796-zgc-systemgcGravatar Aleksey Shipilev 4 weeks
pr/1938Merge branch 'master' into JDK-8008243-zero-fast-bytecodesGravatar Aleksey Shipilev 4 weeks
pr/6328Moved non-instrument tests to the right placeGravatar Jesper Wilhelmsson 4 weeks
pr/6330indentGravatar Albert Yang 4 weeks
pr/6329[PATCH] Remove unused local variables in jdk.hotspot.agentGravatar Andrey Turbanov 4 weeks
pr/63268276926: Use String.valueOf() when initializing File.separator and File.pathS...Gravatar Sergey Tsypanov 4 weeks
pr/6324Add memory barrierGravatar Thomas Schatzl 4 weeks
pr/6322Fix include guardsGravatar Hamlin-Li 4 weeks
pr/5670Add header fileGravatar casparcwang 4 weeks
pr/6269Remove SYSROOT_FLAGSGravatar Yasumasa Suenaga 4 weeks
pr/6271Removed temporary addition of html version.Gravatar David Holmes 4 weeks
pr/5743Merge remote-tracking branch 'origin/8273154.JavadocTester-checker' into 8273...Gravatar Jonathan Gibbons 4 weeks
pr/5987Add testGravatar Nils Eliasson 4 weeks
pr/6300Change adding of access options to or-ingGravatar Harold Seigel 4 weeks
pr/5746Review feedbackGravatar Hannes Wallnoefer 4 weeks
pr/6319Use cygwin version 3.2.0 on GitHub ActionsGravatar Anirvan Sarkar 4 weeks
pr/6315clarify the target thread parameter.Gravatar Daniel D. Daugherty 4 weeks
pr/63188276880: Remove java/lang/RuntimeTests/exec/ExecWithDir as unnecessaryGravatar Roger Riggs 4 weeks
pr/63178276609: Invalid system property `jdk.serialFilter` set on the command line s...Gravatar Roger Riggs 4 weeks
pr/5911Add newlineGravatar Hannes Wallnoefer 4 weeks
pr/6314FixGravatar Aleksey Shipilev 4 weeks
pr/63328276229: Stop allowing implicit updates in G1BlockOffsetTableGravatar Stefan Johansson 4 weeks
pr/6309Remove commentGravatar Thomas Schatzl 4 weeks
pr/6308FixGravatar Aleksey Shipilev 4 weeks
pr/6307FixGravatar Aleksey Shipilev 4 weeks
pr/6166Albert reviewGravatar Stefan Johansson 4 weeks
pr/6303Just rename to remove iterate in namesGravatar Hamlin-Li 4 weeks
pr/6305Initial commitGravatar Hamlin-Li 4 weeks
pr/63048276841: Add support for Visual Studio 2022Gravatar Yasumasa Suenaga 4 weeks
pr/6302Initial commitGravatar Hamlin-Li 4 weeks
pr/6226Update affected long timezone names with its English nameGravatar Yoshiki SATO 4 weeks
pr/63218276775: ZonedDateTime/OffsetDateTime.toString return invalid ISO-8601 for ye...Gravatar Naoto Sato 4 weeks
pr/6286Update history of preview feature.Gravatar Joe Darcy 4 weeks
pr/62978276806: Use Objects.checkFromIndexSize where possible in java.baseGravatar Sergey Tsypanov 4 weeks
pr/62998276808: java/nio/channels/Channels/TransferTo.java timed outGravatar Brian Burkhalter 4 weeks
pr/62988276678: Malformed Javadoc inline tags in JDK source in com/sun/beans/decoder...Gravatar Alisen Chung 4 weeks
pr/6292fix jcheck failure - convert tab to spaceGravatar jpai 4 weeks
pr/62788276654: element-list order is non deterministicGravatar Andrew Leonard 4 weeks
pr/6295FixGravatar Aleksey Shipilev 4 weeks
pr/6230Merge branch 'master' into 8276548-range-based-visitorGravatar Thomas Schatzl 4 weeks
pr/6273Review commentsGravatar Pankaj Bansal 4 weeks
pr/63128276546: [IR Framework] Whitelist and ignore CompileThresholdGravatar Christian Hagedorn 4 weeks
pr/62908276679: Malformed Javadoc inline tags in JDK source in javax/swingGravatar Prasanta Sadhukhan 4 weeks
pr/6181update according to commentsGravatar Denghui Dong 4 weeks
pr/62888276790: Rename GenericCDSFileMapHeader::_base_archive_path_offsetGravatar iklam 4 weeks
pr/62878269986: Remove +3 from Symbol::identity_hash()Gravatar iklam 4 weeks
pr/5580Merge remote-tracking branch 'origin/master' into cleanup_use_enhanced-for_in...Gravatar Andrey Turbanov 4 weeks
pr/6285Added new test case where base archive does not existGravatar iklam 4 weeks
pr/4677coleenp CR - clarify need for ThreadsListHandle in JvmtiEventControllerPrivat...Gravatar Daniel D. Daugherty 4 weeks
pr/6197Fix 80+ char linesGravatar Jamil Nimeh 4 weeks
pr/6283Whitespace clean upGravatar Alexey Semenyuk 4 weeks
pr/6233Merge branch 'master' into 8276408-deprecate-runtime-execGravatar Roger Riggs 4 weeks
pr/6284JDK-8276768: Snippet copy feature should use button instead of linkGravatar Hannes Wallnoefer 4 weeks
pr/6281 JDK-8276562: Fix to JDK-8263155 left out the help text changesGravatar Andy Herrick 4 weeks
pr/62798276746: Add section on reproducible builds in building.mdGravatar Magnus Ihse Bursie 4 weeks
pr/62708268882: C2: assert(n->outcnt() != 0 || C->top() == n || n->is_Proj()) failed...Gravatar Rickard Bäckman 4 weeks
pr/6277dont uncommit when returning chunks but leave uncommitting to Metaspace::purge()Gravatar tstuefe 4 weeks
pr/6274restart failed github testsGravatar Leo Korinth 4 weeks
pr/6267Fix memory orderingGravatar Zhengyu Gu 4 weeks
pr/5181Fix typoGravatar Hamlin-Li 4 weeks
pr/62728276688: Remove JLinkReproducibleXXXTest from ProblemList.txtGravatar jpai 4 weeks
pr/6204use align_down_boundedGravatar Kim Barrett 5 weeks
pr/61938273967.cr1.patchGravatar Daniel D. Daugherty 5 weeks
pr/5024tiny spec change to be the same as CSRGravatar Weijun Wang 5 weeks
pr/62688276400: openjdk image Jars, Zips and Jmods built from the same source are no...Gravatar Andrew Leonard 5 weeks
pr/5997Add one more test and fixed the log usageGravatar Yumin Qi 5 weeks
pr/6265change filename to jsvml*Gravatar Sandhya Viswanathan 5 weeks
pr/6266JDK-8276650: GenGraphs does not produce deterministic outputGravatar Mandy Chung 5 weeks
pr/6255Also update copyright yearGravatar Magnus Ihse Bursie 5 weeks
pr/6249Also update copyright yearGravatar Magnus Ihse Bursie 5 weeks
pr/6253Also update copyright yearGravatar Magnus Ihse Bursie 5 weeks
pr/6251Also update copyright yearGravatar Magnus Ihse Bursie 5 weeks
pr/62648276655: Use blessed modifier order in SCTPGravatar Magnus Ihse Bursie 5 weeks
pr/6262Added row headers in Character docsGravatar Ludvig Janiuk 5 weeks
pr/6261Added table headersGravatar Ludvig Janiuk 5 weeks
pr/6237Per-use Options factory methodGravatar Vladimir Kozlov 5 weeks
pr/6260Oops, trailing whitespaceGravatar Ludvig Janiuk 5 weeks
pr/6232Fix inconsistent formattingGravatar Pavel Rappo 5 weeks
pr/6256Ignore `jaccessinspector-32` and `jaccesswalker-32`Gravatar Christian Stein 5 weeks
pr/62548276640: Use blessed modifier order in jfr codeGravatar Magnus Ihse Bursie 5 weeks
pr/62528276634: Remove `usePlainDatagramSocketImpl` option from the test DatagramCha...Gravatar Patrick Concannon 5 weeks
pr/62508276629: Use blessed modifier order in core-libs codeGravatar Magnus Ihse Bursie 5 weeks
pr/6236AlternativeGravatar Per Liden 5 weeks
pr/6247Address review comments from Andrew.Gravatar Ningsheng Jian 5 weeks
pr/6187FixGravatar Aleksey Shipilev 5 weeks
pr/6248FixGravatar Aleksey Shipilev 5 weeks
pr/6257Remove reflection invocation target printing from VM.metaspace, VM.classloade...Gravatar tstuefe 5 weeks
pr/6078use Enum#name() for hashCode() generation instead of Enum#ordinal()Gravatar jpai 5 weeks
pr/6245JDK-8276572: Fake libsyslookup.so library causes tooling issuesGravatar Andrew Hughes 5 weeks
pr/6246Initial commitGravatar Hamlin-Li 5 weeks
pr/5923Merge branch 'master' into 8275185-jvmstat-LocalVmManager-cleanup-and-remove-...Gravatar iklam 5 weeks
pr/62448276615: Update CR number of some tests in ProblemList-zgc.txtGravatar Yasumasa Suenaga 5 weeks
pr/6243cleanup testGravatar Dean Long 5 weeks
pr/6218fix compilation errorGravatar Doug Simon 5 weeks
pr/6188Remove accidentally committed experimental @Stable (no effect on micros)Gravatar Claes Redestad 5 weeks
pr/62428231490: Fix a data race in java.util.zip.InflaterGravatar Éamonn McManus 5 weeks
pr/6202Revert change for not-custom loader related, fixed file relative pathGravatar Yumin Qi 5 weeks
pr/62388276199: java/nio/channels/FileChannel/LargeGatheringWrite.java fails to term...Gravatar Brian Burkhalter 5 weeks
pr/6239Initial commitGravatar Pavel Rappo 5 weeks
pr/5760Fix jcheck issuesGravatar Alexey Bakhtin 5 weeks
pr/5950same spec in SPIGravatar Weijun Wang 5 weeks
pr/62358276556: ProblemList java/nio/channels/FileChannel/LargeGatheringWrite.java o...Gravatar Daniel D. Daugherty 5 weeks
pr/62348276429: CodeHeapState::print_names() fails with "assert(klass->is_loader_ali...Gravatar Evgeny Astigeevich 5 weeks
pr/6231FixGravatar Aleksey Shipilev 5 weeks
pr/6229FixGravatar Thomas Schatzl 5 weeks
pr/62288276401: Use blessed modifier order in java.net.httpGravatar Daniel Fuchs 5 weeks
pr/6084bugfixGravatar Daniel Jelinski 5 weeks
pr/6142Fix indentation for Java code by using 4 whitespaceGravatar Jie Fu 5 weeks
pr/6199Merge branch 'master' into alphaGravatar Sergey Bylokhov 5 weeks
pr/6225Add assertGravatar Hamlin-Li 5 weeks
pr/6224Merge branch 'openjdk:master' into remove-G1SegmentedArrayBufferList-addGravatar Hamlin Li 5 weeks
pr/62208274860: gcc 10.2.1 produces an uninitialized warning in sharedRuntimeTrig.cppGravatar Joshua Cao 5 weeks
pr/62198276252: java/nio/channels/Channels/TransferTo.java failed with OOM java hea...Gravatar Brian Burkhalter 5 weeks
pr/62178276385: Re-run blessed-modifier-order script on java.desktop and jdk.accessi...Gravatar prrace 5 weeks
pr/55948273922: Change getNameCount() != 1 tp getParent() != nullGravatar Brian Burkhalter 5 weeks
pr/6211restart failed github testsGravatar Leo Korinth 5 weeks
pr/6165Minimize list of recognized file extensionsGravatar Hannes Wallnoefer 5 weeks
pr/62168276207: Properties.loadFromXML/storeToXML works incorrectly for supplementar...Gravatar Anirvan Sarkar 5 weeks
pr/6213Initial commitGravatar Pavel Rappo 5 weeks
pr/62108263153: AssertionError at jdk.compiler/com.sun.tools.javac.util.Assert.error...Gravatar Guoxiong Li 5 weeks
pr/6189add testGravatar Christian Hagedorn 5 weeks
pr/6208FixGravatar Aleksey Shipilev 5 weeks
pr/62078276149: jshell throws EOF error when throwing exception inside switch expres...Gravatar Jan Lahoda 5 weeks
pr/62038276266: Clean up incorrect client-libs ProblemList.txt entriesGravatar prrace 5 weeks
pr/6182Fix incorrect use of `receiveReplyFor' causing test failuresGravatar Jakob Cornell 5 weeks
pr/62018276260: (se) Remove java/nio/channels/Selector/Wakeup.java from ProblemList ...Gravatar Brian Burkhalter 5 weeks
pr/6184Keep intrinsics on StrictMathGravatar Aleksey Shipilev 5 weeks
pr/6093IndentationGravatar Markus Karg 5 weeks
pr/61988276188: Clarify "default charset" descriptions in String classGravatar Naoto Sato 5 weeks
pr/6196Striped tables and table row headersGravatar Ludvig Janiuk 5 weeks
pr/62008275729: Qualified method names in CodeHeap AnalyticsGravatar Evgeny Astigeevich 5 weeks
pr/6177reformat pixel checkGravatar Alisen Chung 5 weeks
pr/6191Use the blessed modifiers orderGravatar Pavel Rappo 5 weeks
pr/57718274544: Langtools command's usage were garbled on Japanese WindowsGravatar takiguc 5 weeks
pr/6195Fixes JDK-8276236Gravatar Ludvig Janiuk 5 weeks
pr/6176WhitespaceGravatar Aleksey Shipilev 5 weeks
pr/61948202667: java/awt/Debug/DumpOnKey/DumpOnKey.java times out on WindowsGravatar Alexander Zuev 5 weeks
pr/61908276044: ciReplay: C1 does not dump a replay file when using DumpReplay as co...Gravatar Christian Hagedorn 5 weeks
pr/6120fix comment in ~ThreadBlockInVMPreprocess()Gravatar Patricio Chilano Mateo 5 weeks
pr/6183InitialGravatar Erik Gahlin 5 weeks
pr/5887Merge remote-tracking branch 'origin/master' into JDK-8260428Gravatar Patrick Concannon 5 weeks
pr/6117address PR commentsGravatar Julia Boes 5 weeks
pr/6209Fixing tests.Gravatar Jan Lahoda 5 weeks
pr/6185JDK-8276036: The value of full_count in the message of insufficient codecache...Gravatar Tobias Holenstein 5 weeks
pr/5705use swap(ref,ref)Gravatar Yi Yang 5 weeks
pr/6149Restore RN for fullFenceGravatar Aleksey Shipilev 5 weeks
pr/6180Refresh the window icon on graphics configuration changesGravatar Emmanuel Bourg 5 weeks
pr/6179v0Gravatar Zhengyu Gu 5 weeks
pr/57938274308: Improve efficiency for HandshakeContext initializationGravatar Clive Verghese 5 weeks
pr/6178Fix expand outputGravatar Jonathan Joo 5 weeks
pr/6053Correct comment on the handling of ClassNotFoundExceptionGravatar Roger Riggs 5 weeks
pr/6174Use DISABLED_ prefix to switch off test on ppcGravatar tstuefe 5 weeks
pr/6004restart failed github testsGravatar Leo Korinth 5 weeks
pr/61688276164: RandomAccessFile#write method could throw IndexOutOfBoundsException ...Gravatar Yano, Masanori 5 weeks
pr/61728271056: C2: "assert(no_dead_loop) failed: dead loop detected" due to cmoving...Gravatar Christian Hagedorn 5 weeks
pr/61698276166: Remove dead code from MimeTable and MimeEntryGravatar Sergey Tsypanov 5 weeks
pr/6041revert subtest renamingGravatar tstuefe 5 weeks
pr/6025removed file added by accidentGravatar frkator 5 weeks
pr/6167FixGravatar Aleksey Shipilev 5 weeks
pr/59038275086: compiler/c2/irTests/TestPostParseCallDevirtualization.java fails whe...Gravatar sunguoyun 5 weeks
pr/6160Fix log messageGravatar Thomas Schatzl 5 weeks
pr/6128Protect from second mouse move image invocation.Gravatar Alexander Zuev 5 weeks
pr/6170Add bug ref in existing testGravatar Kevin Walls 5 weeks
pr/6131Remove dead uses of is_concreteGravatar Nick Gasson 5 weeks
pr/6140Review fixGravatar Prasanta Sadhukhan 5 weeks
pr/6164more EDTGravatar Aleksandr Zvegintsev 6 weeks
pr/6126Used LinkedHashSetGravatar Hai-May Chao 6 weeks
pr/61228274750: Suppress compilation warning about SecurityManager deprecation for r...Gravatar Brian Burkhalter 6 weeks
pr/6162Fix spelling.Gravatar Igor Veresov 6 weeks
pr/5901convert to TestNG testGravatar Mandy Chung 6 weeks
pr/61638276128: (bf) Remove unused constant ARRAY_BASE_OFFSET from Direct-X-BufferGravatar Brian Burkhalter 6 weeks
pr/5748Address review notesGravatar Ilarion Nakonechnyy 6 weeks
pr/6152IS_EMPTY define did not work on msvcGravatar Magnus Ihse Bursie 6 weeks
pr/61618169474: KeyCharTest: Wrong number of key events: 0Gravatar Alexander Zuev 6 weeks
pr/6192v0Gravatar Zhengyu Gu 6 weeks
pr/61718276121: G1: Remove unused and uninitialized _g1h in g1SATBMarkQueueSet.hppGravatar Leo Korinth 6 weeks
pr/61568275735: [linux] Remove deprecated Metrics api (kernel memory limit)Gravatar Severin Gehwolf 6 weeks
pr/61558276110: Problemlist javax/swing/JMenu/4515762/bug4515762.java for macos12Gravatar Prasanta Sadhukhan 6 weeks
pr/6154Initial versionGravatar Thomas Schatzl 6 weeks
pr/6010Removed html fluffGravatar Ludvig Janiuk 6 weeks
pr/6153FixGravatar Aleksey Shipilev 6 weeks
pr/5386Specialize match rules for UseSSE < 2Gravatar Aleksey Shipilev 6 weeks
pr/6103Simplified preprocessor condition and fixed indentation in testGravatar Volker Simonis 6 weeks
pr/61598275868: ciReplay: Inlining fails with "unloaded signature classes" due to wr...Gravatar Christian Hagedorn 6 weeks
pr/6104Moved components instantiation to the EDTGravatar Alexander Zuev 6 weeks
pr/6136Fix the comment to match JDK-8276096Gravatar Aleksey Shipilev 6 weeks
pr/60648275715: D3D pipeline processes multiple PaintEvent at initial drawingGravatar Yano, Masanori 6 weeks
pr/6138Consistent benchmark names: drop excess "Fence"Gravatar Aleksey Shipilev 6 weeks
pr/6090Restore support for IPv6-only operationGravatar Daniel Jelinski 6 weeks
pr/6148startGravatar tstuefe 6 weeks
pr/6147remove functionGravatar tstuefe 6 weeks
pr/61468276067: ZGC: Remove unused function alloc_high_address_at_most()Gravatar Per Liden 6 weeks
pr/61458275317: AArch64: Support some type conversion vectorization in SLPGravatar Faye Gao 6 weeks
pr/6157linux fixGravatar Aleksandr Zvegintsev 6 weeks
pr/6130Remove unnecessary qualifier scope operator in class java_lang_ClassGravatar Yumin Qi 6 weeks
pr/5027fix copyright header and typoGravatar Mandy Chung 6 weeks
pr/6092Merge remote-tracking branch 'origin/master' into remove_unused_local_variabl...Gravatar Andrey Turbanov 6 weeks
pr/6123Remove incorrect comment.Gravatar Coleen Phillimore 6 weeks
pr/6127Adjust parsing os.version to handle no dot version in case it's allowedGravatar Mandy Chung 6 weeks
pr/6356Update parameter names; Add constructor overload for backward compatibilityGravatar ivan-ristovic 6 weeks
pr/60918276042: Remove unused local variables in java.namingGravatar Andrey Turbanov 6 weeks
pr/61438255286: Implement ParametersTypeData::print_data_on fullyGravatar Aleksey Shipilev 6 weeks
pr/6137RenamesGravatar Per Liden 6 weeks
pr/61418276063: ProblemList gtest dll_address_to_function_and_library_name on macosx...Gravatar Daniel D. Daugherty 6 weeks
pr/6158JDK-8275909: [JVMCI] c2v_readFieldValue use long instead of jlong for the off...Gravatar Tobias Holenstein 6 weeks
pr/6139FixGravatar Aleksey Shipilev 6 weeks
pr/6100Merge branch 'master' into 4718400_use_size_t_for_object_sizesGravatar Stefan Karlsson 6 weeks
pr/6135Update Long.javaGravatar sswsharm 6 weeks
pr/6133request alekseyGravatar tstuefe 6 weeks
pr/6116Use BUTTON1_DOWN_MASKGravatar jayathirthrao 6 weeks
pr/6119Use class name to verify Graphics configurationGravatar jayathirthrao 6 weeks
pr/6060make metaspace contains threadsafeGravatar tstuefe 6 weeks
pr/6097Review fixGravatar Prasanta Sadhukhan 6 weeks
pr/61448275754: (tz) Update Timezone Data to 2021dGravatar Yoshiki SATO 6 weeks
pr/61298276036: The value of full_count in the message of insufficient codecache is ...Gravatar kiriyama 6 weeks
pr/6075typoGravatar Yi Yang 6 weeks
pr/6134cleanupGravatar Albert Yang 6 weeks
pr/6121initialGravatar Aleksandr Zvegintsev 6 weeks
pr/61188275975: Remove dead code in ciInstanceKlassGravatar Tobias Hartmann 6 weeks
pr/6109fixed spelling and grammarGravatar Doug Simon 6 weeks
pr/2045reviewGravatar rwestrel 6 weeks
pr/6105Move constant pool release_C_heap_structures to the end.Gravatar Coleen Phillimore 6 weeks
pr/60688275872: Sync J2DBench run and analyze Makefile targets with build.xmlGravatar Jiri 6 weeks
pr/6000Add dumppath to JFR.configure dcmdGravatar Yasumasa Suenaga 6 weeks
pr/6096use uncastGravatar Yi Yang 6 weeks
pr/5973Add @since tags.Gravatar Joe Darcy 6 weeks
pr/5290Restore update of copyright messages in resource filesGravatar Jakob Cornell 6 weeks
pr/6070revert the change of calling SystemDictionaryShared::start_dumping() in metas...Gravatar Calvin Cheung 6 weeks
pr/61148269853: Prefetch::read should accept pointer to constGravatar Harold Seigel 6 weeks
pr/6113commentGravatar Albert Yang 6 weeks
pr/61118251904: vmTestbase/nsk/sysdict/vm/stress/btree/btree010/btree010.java fails ...Gravatar Harold Seigel 6 weeks
pr/56238274112: Make transferTo0() static; remove check for null FileDescriptorGravatar Brian Burkhalter 6 weeks
pr/61128233557: [TESTBUG] DoubleClickTitleBarTest.java fails on macOsGravatar Alisen Chung 6 weeks
pr/61108275767: JDK source code contains redundant boolean operations in jdk.charsetsGravatar Naoto Sato 6 weeks
pr/61078275869: Problem list applications/jcstress/copy.java on Linux-aarch64Gravatar Harold Seigel 6 weeks
pr/6106Remove trailing whitespace.Gravatar Sean Mullan 6 weeks
pr/61088275162: Use varargs in 'def' macros in mutexLocker.cppGravatar Coleen Phillimore 6 weeks
pr/6102Use field directlyGravatar Claes Redestad 6 weeks
pr/6098remove MetaspaceHandleDeallocations switchGravatar tstuefe 6 weeks
pr/4001Merge branch 'master' into JDK-8153490Gravatar Mitsuru Kariya 6 weeks
pr/59678275047: Review comments resolution.Gravatar Jatin Bhateja 6 weeks
pr/6045Reflecting review commentsGravatar Naoto Sato 6 weeks
pr/6089initial fixGravatar Anthony Scarpino 6 weeks
pr/60878273704: DrawStringWithInfiniteXform.java failed : drawString with InfiniteXf...Gravatar prrace 6 weeks
pr/6088initialGravatar Aleksandr Zvegintsev 6 weeks
pr/4887Simplified isPrivateKeyValidGravatar Alexey Bakhtin 6 weeks
pr/60858275819: [TableRowAccessibility accessibilityChildren] method is ineffectiveGravatar Anton Tarasov 6 weeks
pr/60868275170: Some jtreg sound tests should be marked headfulGravatar prrace 6 weeks
pr/60838275809: crash in [CommonComponentAccessibility getCAccessible:withEnv:]Gravatar Anton Tarasov 6 weeks
pr/60818275720: CommonComponentAccessibility.createWithParent isWrapped causes mem leakGravatar Anton Tarasov 6 weeks
pr/6056extra safetyGravatar Aleksandr Zvegintsev 6 weeks
pr/6033Refine code furtherGravatar Hamlin-Li 6 weeks
pr/6079region-typeGravatar Albert Yang 6 weeks
pr/60808274734: the method jdk.jshell.SourceCodeAnalysis documentation not workingGravatar Jan Lahoda 6 weeks
pr/4839fix stylesGravatar Wanghuang-Huawei 6 weeks
pr/6071update to show fields of serializable records in the serializable formGravatar Jonathan Gibbons 7 weeks
pr/6054Move test from java/nio to java/ioGravatar Clive Verghese 7 weeks
pr/5709Merge branch 'master' into JDK-8202056Gravatar Joe Darcy 7 weeks
pr/6069v0Gravatar Zhengyu Gu 7 weeks
pr/60678233568: [TESTBUG] AWT event tests failing on MacOSGravatar Alisen Chung 7 weeks
pr/5912 Merge branch 'master' into JDK-8263155Gravatar Andy Herrick 7 weeks
pr/5928Add setTrustAnchorAndKeys method and change ctor and trySetTrustAnchor to cal...Gravatar Sean Mullan 7 weeks
pr/6065v0Gravatar Zhengyu Gu 7 weeks
pr/60668275162: Replace 'def' macros in mutexLocker.cppGravatar Coleen Phillimore 7 weeks
pr/6044avoid unaligned volatile reads in c2v_readFieldValueGravatar Doug Simon 7 weeks
pr/60778275717: Reimplement STATIC_ASSERT to use static_assertGravatar Stefan Karlsson 7 weeks
pr/6061JDK-8269401: Include Throwable in exception classesGravatar Hannes Wallnoefer 7 weeks
pr/6063Remove tabGravatar Stefan Karlsson 7 weeks
pr/6037Change MinInliningThreshold to TypeProfileLevel in IRExampleGravatar Christian Hagedorn 7 weeks
pr/6036Remove the ability to purge a vslistGravatar tstuefe 7 weeks
pr/6058JDK-8275688: Suppress warnings on non-serializable non-transient instance fie...Gravatar Joe Darcy 7 weeks
pr/6057fix replay line terminationGravatar Dean Long 7 weeks
pr/6055JDK-8275686: Suppress warnings on non-serializable non-transient instance fie...Gravatar Joe Darcy 7 weeks
pr/6052Override the LPR path using a system propertyGravatar Rolf van Kleef 7 weeks
pr/6062g1policyGravatar Albert Yang 7 weeks
pr/6051Add linux-aarch64 to test make profileGravatar M. Seledtsov 7 weeks
pr/60508275666Gravatar iignatyev 7 weeks
pr/5998Keep SPECIES_REOLVE classes shared, but filtered them out as regular classes ...Gravatar Yumin Qi 7 weeks
pr/60498251134: Unwrapping a key with a Private Key generated by Microsoft CNG failsGravatar Weijun Wang 7 weeks
pr/60478185844: MSCAPI doesn't list aliases correctlyGravatar Weijun Wang 7 weeks
pr/6046Remove old option from a testGravatar Igor Veresov 7 weeks
pr/60278198336: java/awt/FontMetrics/FontCrash.java fails in headless modeGravatar prrace 7 weeks
pr/6040d.setLocationRelativeTo(null);Gravatar Aleksandr Zvegintsev 7 weeks
pr/59224619075: Move read-only check to before read loopGravatar Brian Burkhalter 7 weeks
pr/5964Removed +open from jtreg modulesGravatar Evan Whelan 7 weeks
pr/6028Call dispose() from the test final block. Also added original exception to th...Gravatar Alexander Zuev 7 weeks
pr/6011Update copyright yearsGravatar Hannes Wallnoefer 7 weeks
pr/60428274714: Incorrect verifier protected access error messageGravatar Harold Seigel 7 weeks
pr/6030Fix typoGravatar Stefan Karlsson 7 weeks
pr/6015added bugid, othervmGravatar Aleksandr Zvegintsev 7 weeks
pr/60398274888: Dump "-DReproduce=true" to the test VM command line outputGravatar Christian Hagedorn 7 weeks
pr/5944Address PR commentsGravatar Hannes Wallnoefer 7 weeks
pr/6034Fix cransh on Mac; remove unnecessary codeGravatar Hamlin-Li 7 weeks
pr/36198240756: [macos] SwingSet2:TableDemo:Printed Japanese characters were garbledGravatar Toshio Nakamura 7 weeks
pr/6031FixGravatar Aleksey Shipilev 7 weeks
pr/6032Initial commitGravatar Hamlin-Li 7 weeks
pr/6029FixGravatar Aleksey Shipilev 7 weeks
pr/6035Initial commitGravatar Hamlin-Li 7 weeks
pr/6043Initial commit for JDK-8275535.Gravatar mbalao 7 weeks
pr/60238248584: Enable CHECK_UNHANDLED_OOPS for Windows fastdebug buildsGravatar Harold Seigel 7 weeks
pr/5933refactoring to remove code duplication by using a common routine for UMulHiLN...Gravatar vamsi-parasa 7 weeks
pr/6022removed from ProblemListGravatar Alisen Chung 7 weeks
pr/6012upgrade the version in GHA configGravatar Weijun Wang 7 weeks
pr/60218272614: Unused parameters in MethodHandleNatives linking methodsGravatar Harold Seigel 7 weeks
pr/60208273678 TableAccessibility and TableRowAccessibility miss autoreleaseGravatar Artem Semenov 7 weeks
pr/60197124287: [TEST_BUG] [macosx] JTableHeader doesn't get focus after pressing F8...Gravatar Prasanta Sadhukhan 7 weeks
pr/5954fullusage test changeGravatar Hai-May Chao 7 weeks
pr/5387review updatesGravatar Leo Korinth 7 weeks
pr/6013reviewGravatar Albert Yang 7 weeks
pr/5988Roger's review suggestion - rethrow the RuntimeException instead of wrapping ...Gravatar jpai 7 weeks
pr/5895Fix windows compilationGravatar Thomas Schatzl 7 weeks
pr/6016JDK-8230130: javadoc search result dialog shows cut off headers for long resultsGravatar Hannes Wallnoefer 7 weeks
pr/6014initialGravatar Aleksandr Zvegintsev 7 weeks
pr/6017v0Gravatar Zhengyu Gu 7 weeks
pr/60088268595: java/io/Serializable/serialFilter/GlobalFilterTest.java#id1 failed i...Gravatar jpai 7 weeks
pr/60058233724: Remove -Wc++14-compat warning suppression in operator_new.cppGravatar Harold Seigel 7 weeks
pr/5851ayang reviewGravatar Thomas Schatzl 7 weeks
pr/6001headerGravatar mgronlun 7 weeks
pr/60028255724: [XRender] the BlitRotateClippedArea test fails on Linux in the XR pi...Gravatar jayathirthrao 7 weeks
pr/5956Adapt line length to 80 column displayGravatar Daniel Jelinski 7 weeks
pr/6003g1-make-reference-aliveGravatar Albert Yang 7 weeks
pr/53698273317: crash in cmovP_cmpP_zero_zeroNode::bottom_type()Gravatar sunguoyun 7 weeks
pr/5327fix code styleGravatar wuyan0 7 weeks
pr/6024Add linux-aarch64-zero to jib build profilesGravatar M. Seledtsov 7 weeks
pr/59998192931: Regression test java/awt/font/TextLayout/CombiningPerf.java failsGravatar prrace 7 weeks
pr/60098275302: unexpected compiler error: cast, intersection types and sealedGravatar Vicente Romero 7 weeks
pr/5990Merge branch 'master' into jmethodidGravatar Coleen Phillimore 7 weeks
pr/59967008363: TEST_BUG: test/java/lang/StringCoding/CheckEncodings.sh does nothing...Gravatar Naoto Sato 7 weeks
pr/5992Prepare Leak Profiler for LilliputGravatar mgronlun 7 weeks
pr/5993change num_chunks calculationGravatar Kim Barrett 7 weeks
pr/5958tstuefe suggestions.Gravatar Coleen Phillimore 7 weeks
pr/5991v0Gravatar Zhengyu Gu 7 weeks
pr/59868255898: Test java/awt/FileDialog/FilenameFilterTest/FilenameFilterTest.java ...Gravatar jayathirthrao 7 weeks
pr/55218275242: Remove redundant stream() call before forEach in jdk.compilerGravatar Andrey Turbanov 7 weeks
pr/4731relax memory ordering constraintGravatar mgronlun 7 weeks
pr/5985[PATCH] Use Optional.isEmpty instead of !Optional.isPresent in java.net.httpGravatar Andrey Turbanov 7 weeks
pr/5966Fix typoGravatar Stefan Karlsson 7 weeks
pr/59848275375: jfr/api/consumer/security/TestStreamingRemote.java fails with Access...Gravatar Yasumasa Suenaga 7 weeks
pr/5478correct commentsGravatar Hamlin-Li 7 weeks
pr/5983[PATCH] Change nested classes in jdk.jlink to static nested classesGravatar Andrey Turbanov 7 weeks
pr/5982JDK-8275368: Correct statement of kinds of elements Processor.process operate...Gravatar Joe Darcy 7 weeks
pr/5979JDK-8275360: Use @Override in javax.annotation.processingGravatar Joe Darcy 7 weeks
pr/5978[PATCH] Change nested classes in jdk.jdi to static nested classesGravatar Andrey Turbanov 7 weeks
pr/5976Allignment issuesGravatar Pankaj Bansal 7 weeks
pr/5974[PATCH] Change nested classes in jdk.jconsole to static nested classesGravatar Andrey Turbanov 7 weeks
pr/5039Removed additional thread and card set codeGravatar Yude Lin 7 weeks
pr/5421Added code comments for private methodsGravatar Markus Karg 7 weeks
pr/5975Update LCMS.cGravatar mrserb 7 weeks
pr/5870Address review commentsGravatar Jonathan Gibbons 7 weeks
pr/59728275150: URLClassLoaderTable should store OopHandle instead of HandleGravatar Calvin Cheung 7 weeks
pr/5995Use all proxy configsGravatar Daniel Jeliński 7 weeks
pr/5971[PATCH] Change nested classes in java.prefs to static nested classesGravatar Andrey Turbanov 7 weeks
pr/5884replaced nativePushNSWindowToFront() with orderAboveSiblings()Gravatar Alisen Chung 7 weeks
pr/5970Fix assertGravatar Zhengyu Gu 7 weeks
pr/59688275334: Move class loading Events to a separate section in hs_err filesGravatar Stefan Karlsson 7 weeks
pr/54917001973: java/awt/Graphics2D/CopyAreaOOB.java failsGravatar Yano, Masanori 7 weeks
pr/5938print argument key if not foundGravatar Denghui Dong 7 weeks
pr/5965Fix assertionGravatar Thomas Schatzl 7 weeks
pr/59638275293: A change done with JDK-8268764 mismatches the java.rmi.server.ObjID....Gravatar Sergey Tsypanov 7 weeks
pr/5962[PATCH] Change nested classes in java.management to static nested classesGravatar Andrey Turbanov 7 weeks
pr/59618274937: Revert the timeout setting for DynamicLoaderConstraintsTestGravatar Calvin Cheung 8 weeks
pr/59608049520: FileCredentialsCache loads cache once and is never refreshedGravatar Weijun Wang 8 weeks
pr/59698257534: vmTestbase/gc/lock/jvmti/alloc/jvmtialloclock03/TestDescription.java...Gravatar Coleen Phillimore 8 weeks
pr/59598274301: Locking with _no_safepoint_check_flag does not check NJTGravatar Coleen Phillimore 8 weeks
pr/5930Added the right test case failure bugidGravatar lawrence.andrews 8 weeks
pr/5844Rename WellKnownTypes to WellKnownTypeSignaturesGravatar Liam Miller-Cushon 8 weeks
pr/5935Add assert that MultiArray_lock is held for loaded_classes_do.Gravatar Coleen Phillimore 8 weeks
pr/5949FixGravatar Aleksey Shipilev 8 weeks
pr/59488275252: Migrate cacerts from JKS to password-less PKCS12Gravatar Weijun Wang 8 weeks
pr/5947JDK-8223357: No marker comment for a package in package-summary.htmlGravatar Hannes Wallnoefer 8 weeks
pr/5946JDK-8223356: Bad placement of marker comment in module-summary.htmlGravatar Hannes Wallnoefer 8 weeks
pr/5019Add warning messageGravatar Yasumasa Suenaga 8 weeks
pr/5913throw RuntimeExceptionGravatar Fernando Guallini 8 weeks
pr/5945Remove redundant castGravatar Hannes Wallnoefer 8 weeks
pr/5951initial commitGravatar Julia Boes 8 weeks
pr/5886Merge masterGravatar Per Liden 8 weeks
pr/5940JDK-8275272: Problem list ButtonDemoScreenshotTest.java for linux OSGravatar Amresh Sahu 8 weeks
pr/5957move assertGravatar Albert Yang 8 weeks
pr/59428275265: Two java/nio/channels tests fails on x86_32Gravatar Jie Fu 8 weeks
pr/59048275240: Change nested classes in jdk.attach to static nested classesGravatar Andrey Turbanov 8 weeks
pr/59418275262: Backout JDK-8269559Gravatar Nick Gasson 8 weeks
pr/5927add a summary to the test as well as use a different logger than String.class...Gravatar jpai 8 weeks
pr/5129Replace `sve_cmpne` with up-to-date `sve_cmp`.Gravatar TatWai Chong 8 weeks
pr/5936JDK-8275249: Suppress warnings on non-serializable array component types in j...Gravatar Joe Darcy 8 weeks
pr/5939cleanupGravatar mrserb 8 weeks
pr/59538275145: file.encoding system property has an incorrect value on WindowsGravatar Naoto Sato 8 weeks
pr/59328275234 : java/awt/GraphicsDevice/DisplayModes/CycleDMImage.java is entered t...Gravatar lawrence.andrews 8 weeks
pr/5931Add missing @throws for ReadOnlyBufferExceptionGravatar Lance Andersen 8 weeks
pr/5828Apply suggestions from code reviewGravatar Bernhard Urban-Forster 8 weeks
pr/59268262912: ciReplay: replay does not simulate unresolved classesGravatar Christian Hagedorn 8 weeks
pr/5897Removing trailing whitespaceGravatar Jan Lahoda 8 weeks
pr/5925JDK-8275187: Suppress warnings on non-serializable array component types in j...Gravatar Joe Darcy 8 weeks
pr/59068274718: runtime/cds/appcds/LambdaEagerInit.java fails with -XX:-CompactStringsGravatar fmatte 8 weeks
pr/5924JDK-8275186: Suppress warnings on non-serializable array component types in xmlGravatar Joe Darcy 8 weeks
pr/59218275173: testlibrary_tests/ir_framework/tests/TestCheckedTests.java fails aft...Gravatar Jie Fu 8 weeks
pr/5920Create hsdis backend using LLVMGravatar Magnus Ihse Bursie 8 weeks
pr/5908Fixes after code review remarksGravatar Magnus Ihse Bursie 8 weeks
pr/5917[PATCH] Remove unused fields in ThaiBuddhistChronologyGravatar Andrey Turbanov 8 weeks
pr/5916forgot to handle non aarch64 architectureGravatar gerard ziemski 8 weeks
pr/5929v0Gravatar Zhengyu Gu 8 weeks
pr/59148275149: throw RuntimeException if IAE not thrownGravatar Brian Burkhalter 8 weeks
pr/5892Use o instead of *p plus further cleanup.Gravatar Martin Doerr 8 weeks
pr/5891Fix diff by forcing LF as the line-endingGravatar Christian Stein 8 weeks
pr/5806use Objects.requireNonNullGravatar Aleksandr Zvegintsev 8 weeks
pr/5786ayang review2 - optimize remove()Gravatar Thomas Schatzl 8 weeks
pr/59108275131: Exceptions after a touchpad gesture on macOSGravatar Dmitry Batrak 8 weeks
pr/5505Minor rewording of bind address outputGravatar Julia Boes 8 weeks
pr/5875clarify need for defensive codeGravatar Doug Simon 8 weeks
pr/5871[PATCH] Cleanup Iterator usages in java.desktopGravatar Andrey Turbanov 8 weeks
pr/59058275097: Wrong span of the 'default' tagGravatar Jan Lahoda 8 weeks
pr/5738Merge branch 'openjdk:master' into maintain_canonical_order_in_module-info.javaGravatar kabutz 8 weeks
pr/5590Change to VM unconditionally as long as current thread is JavaThread.Gravatar Xin Liu 8 weeks
pr/5569Minor update for review comments.Gravatar Valerie Peng 8 weeks
pr/58788275002: Remove unused AbstractStringBuilder.MAX_ARRAY_SIZEGravatar Andrey Turbanov 8 weeks
pr/57958275079: Remove unnecessary conversion to String in java.net.httpGravatar Andrey Turbanov 8 weeks
pr/4949Merge branch 'master' into JDK-8271514Gravatar Daniel D. Daugherty 8 weeks
pr/54328274879: Replace uses of StringBuffer with StringBuilder within java.base cla...Gravatar Andrey Turbanov 8 weeks
pr/58998275074: Cleanup unused code in JFR LeakProfilerGravatar Roman Kennke 8 weeks
pr/5896Fix optimized build (move print_on) up.Gravatar Coleen Phillimore 8 weeks
pr/5898Merge branch 'master' into JDK-8275051-gc_req_orderGravatar Zhengyu Gu 8 weeks
pr/58318274548: On macOS, remove dependence on Darwin version in native writevMax()Gravatar Brian Burkhalter 8 weeks
pr/5840Removing trailing whitespaceGravatar Jan Lahoda 8 weeks
pr/5865Aleksey's commentGravatar Zhengyu Gu 8 weeks
pr/5894Fix flag handling for MacOS.Gravatar theRealAph 8 weeks
pr/5868Aleksey's commentGravatar Zhengyu Gu 8 weeks
pr/5890refine commentsGravatar linzang 8 weeks
pr/58938274911: testlibrary_tests/ir_framework/tests/TestIRMatching.java fails with ...Gravatar Christian Hagedorn 8 weeks
pr/5888FixGravatar Aleksey Shipilev 8 weeks
pr/58898274982: Add a test for 8269574.Gravatar Evgeny Nikitin 8 weeks
pr/5867JDK-8275027:Create JDK test library classes for manual tests UI.Gravatar Amresh Sahu 8 weeks
pr/5885Update AbsPathsInImage.javaGravatar Bylokhov 8 weeks
pr/58838275013: Improve discussion of serialization method declarations in java.io.O...Gravatar Joe Darcy 8 weeks
pr/5882JDK-8272392 Lanai: SwingSet2. Black background on expanding tree nodeGravatar Alexey Ushakov 8 weeks
pr/5881Update copyright yearGravatar Jie Fu 8 weeks
pr/5880Include globalDefinitions.hppGravatar Jie Fu 8 weeks
pr/5879Applease jcheck.Gravatar Joe Darcy 8 weeks
pr/58768271598: CDS classlist file should support uber JARsGravatar Calvin Cheung 8 weeks
pr/56968274319: Replace usages of Collections.sort with List.sort call in jdk.jfrGravatar Andrey Turbanov 8 weeks
pr/5842Remove superfluous copyright changeGravatar I517973 8 weeks
pr/5866JDK-8274977Gravatar MBaesken 8 weeks
pr/58698274934: Attempting to acquire lock JNICritical_lock/41 out of order with loc...Gravatar Coleen Phillimore 8 weeks
pr/5263Review CommentGravatar Pankaj Bansal 8 weeks
pr/58628274952: jdk/jfr/api/consumer/TestRecordedFrameType.java failed when c1 disabledGravatar aoqi 8 weeks
pr/5861Improved log messagesGravatar Thomas Schatzl 8 weeks
pr/5860Undo problem list of the test caseGravatar Lin Zang 9 weeks
pr/5864Initial fix JDK-8274939Gravatar Bylokhov 9 weeks
pr/5859Add test with ZGC fails without fix.Gravatar Coleen Phillimore 9 weeks
pr/5858JDK-8274930Gravatar Alex Menkov 9 weeks
pr/58578274864: Remove Amman/Cairo hacks in ZoneInfoFileGravatar Naoto Sato 9 weeks
pr/5446disable write protection before decoding nmethodGravatar Doug Simon 9 weeks
pr/5854[PATCH] Cleanup unnecessary calls to Throwable.initCause() in java.rmi moduleGravatar Andrey Turbanov 9 weeks
pr/5845Fix overlap error message printing and add a test.Gravatar Coleen Phillimore 9 weeks
pr/58528274785: ciReplay: Potential crash due to uninitialized Compile::_ilt variableGravatar Christian Hagedorn 9 weeks
pr/58508271737: Only normalize the cached user.dir property onceGravatar Evgeny Astigeevich 9 weeks
pr/5837JDK-8251513Gravatar Tobias Holenstein 9 weeks
pr/5847[PATCH] Cleanup unnecessary calls to Throwable.initCause() in java.desktop mo...Gravatar Andrey Turbanov 9 weeks
pr/5433[PATCH] Cleanup usages of StringBuffer in jdk tools modulesGravatar Andrey Turbanov 9 weeks
pr/5841Make variables finalGravatar Seán Coffey 9 weeks
pr/5816[PATCH] Update jdk.compiler classes to use try-with-resourcesGravatar Andrey Turbanov 9 weeks
pr/58568233749: Files.exists javadoc doesn't mention eating IOExceptionGravatar Brian Burkhalter 9 weeks
pr/5839Update error msgGravatar Jie Fu 9 weeks
pr/5768Add offset check for _generic_header in populate_headerGravatar Yumin Qi 2 months
pr/58188274809: Update java.base classes to use try-with-resourcesGravatar Andrey Turbanov 2 months
pr/58438274858: Remove unused dictionary_classes_do functionsGravatar Coleen Phillimore 2 months
pr/5741address David commentsGravatar Patricio Chilano Mateo 2 months
pr/55778274755: Replace 'while' cycles with iterator with enhanced-for in jdk.jdiGravatar Andrey Turbanov 2 months
pr/5780JDK-8274346: Support for additional content in an app-image.Gravatar Andy Herrick 2 months
pr/5846JDK-8274840Gravatar MBaesken 2 months
pr/5824Replace hideSeek with seekableGravatar Florian Weimer 2 months
pr/5825JDK-8274625: Update copyright yearsGravatar Hannes Wallnoefer 2 months
pr/5834[PATCH] Cleanup redundant boxing in java.desktopGravatar Andrey Turbanov 2 months
pr/5481[PATCH] Remove superfluous use of boxing in java.baseGravatar Andrey Turbanov 2 months
pr/5704Split with RANGEBASE_ASCII and RANGEBASE_NON_ASCIIGravatar Jie Fu 2 months
pr/5833fix copyright and trailing whitespaceGravatar Jonathan Gibbons 2 months
pr/5801Combine bad rank range checks.Gravatar Coleen Phillimore 2 months
pr/5832Fix for Asia/Amman test case errorGravatar Naoto Sato 2 months
pr/5830Added synchronization between stdout and stderr warmup predicatesGravatar Alex Menkov 2 months
pr/58278217496 Matcher.group() can return null after usePatternGravatar Ian Graves 2 months
pr/25248274715: Properly format NCopiesBenchmarks.javaGravatar Sergey Tsypanov 2 months
pr/5819Cleanup, no functional change.Gravatar theRealAph 2 months
pr/5836An additional test, and improving preflow/post-attr.Gravatar Jan Lahoda 2 months
pr/5794[PATCH] Simplify equals() call on nullable variable and a constant in java.de...Gravatar Andrey Turbanov 2 months
pr/5815Fix the testsGravatar Igor Veresov 2 months
pr/5684Fix grammar in comment.Gravatar Coleen Phillimore 2 months
pr/58238274773: [TESTBUG] UnsafeIntrinsicsTest intermittently fails on weak memory m...Gravatar Martin Doerr 2 months
pr/5789Fixed the instruction for the testGravatar lawrence.andrews 2 months
pr/57998274680: Remove unnecessary conversion to String in java.desktopGravatar Andrey Turbanov 2 months
pr/58218274770: [PPC64] resolve_jobject needs a generic implementation to support lo...Gravatar Martin Doerr 2 months
pr/5820fix race in testGravatar Kim Barrett 2 months
pr/5791Merge branch 'master' into pretouch_chunk_claimGravatar Kim Barrett 2 months
pr/5804Updated copyright.Gravatar Richard Reingruber 2 months
pr/57248274397: Stop setting env. var JAVA_MAIN_CLASS_<pid> in launcher codeGravatar prrace 2 months
pr/5814JDK-8273745: VerifyLocale.java occasionally times outGravatar Jonathan Gibbons 2 months
pr/5835Update LCMS.javaGravatar mrserb 2 months
pr/5813JDK-8274729: Define Position.NOPOS == Diagnostic.NOPOSGravatar Jonathan Gibbons 2 months
pr/5694Add Constructor benchmarksGravatar Peter Levart 2 months
pr/5812JDK-8274744: TestSnippetTag test fails after recent integrationGravatar Jonathan Gibbons 2 months
pr/5788update copyright yearsGravatar Weijun Wang 2 months
pr/5810JDK-8274745: ProblemList TestSnippetTag.javaGravatar Jonathan Gibbons 2 months
pr/58098274738: ZGC: Use relaxed atomic load when reading bits in the live mapGravatar Per Liden 2 months
pr/58088274721: UnixSystem fails to provide uid, gid or groups if no username is ava...Gravatar Weijun Wang 2 months
pr/58078273342: Null pointer dereference in classFileParser.cpp:2817Gravatar Harold Seigel 2 months
pr/5802Respond to review feedbakc.Gravatar Joe Darcy 2 months
pr/5595print message if printer is not installGravatar lawrence.andrews 2 months
pr/5797Remove toString() callsGravatar Yasumasa Suenaga 2 months
pr/5805Remove delay in cleanup again.Gravatar Richard Reingruber 2 months
pr/5803InitialGravatar Erik Gahlin 2 months
pr/5682commentGravatar Albert Yang 2 months
pr/5800[PATCH] Remove unnecessary conversion to String in jdk.hotspot.agent moduleGravatar Andrey Turbanov 2 months
pr/5811fix: use `Long#hashCode(long)` for `UUID#hashCode()`Gravatar Petr Portnov 2 months
pr/5798[PATCH] Remove unnecessary conversion to String in security code in java.baseGravatar Andrey Turbanov 2 months
pr/5796Fix testsGravatar Tagir Valeev 2 months
pr/5792JDK-8274666: rename HtmlStyle.descfrmTypeLabel to be less crypticGravatar Jonathan Gibbons 2 months
pr/5497removed synthesizeMouseEnteredExitEvent callGravatar Alisen Chung 2 months
pr/56958274318: Replace 'for' cycles with iterator with enhanced-for in java.managementGravatar Andrey Turbanov 2 months
pr/57908274658: ISO 4217 Amendment #170 UpdateGravatar Naoto Sato 2 months
pr/5654backout checksum changesGravatar Weijun Wang 2 months
pr/5510remove unnecessary type qualifierGravatar Jonathan Gibbons 2 months
pr/56458268435: More comments; use assertThrows() instead of expectedExceptionsGravatar Brian Burkhalter 2 months
pr/5778verifier should not use automatically derived parameters failsGravatar Weijun Wang 2 months
pr/5787Fix 8274642Gravatar Christoph Langer 2 months
pr/5756Proper requiresGravatar Aleksey Shipilev 2 months
pr/5717Fixing typo.Gravatar Jan Lahoda 2 months
pr/5785relaxed atomic addGravatar Kim Barrett 2 months
pr/5784Updated TCK test component from @martinGravatar David Holmes 2 months
pr/57828274562: (fs) UserDefinedFileAttributeView doesn't correctly determine if sup...Gravatar Brian Burkhalter 2 months
pr/5783Add linux-aarch64 to bootcycle build profilesGravatar M. Seledtsov 2 months
pr/5781Initial commitGravatar Pavel Rappo 2 months
pr/57798274606: Fix jaxp/javax/xml/jaxp/unittest/transform/SurrogateTest.java testGravatar Alex Kashchenko 2 months
pr/5726Add comments and update copyrights.Gravatar Joe Darcy 2 months
pr/5736JDK-8274435: EXCEPTION_ACCESS_VIOLATION in BFSClosure::closure_implGravatar kvergizova 2 months
pr/57778274597: [TESTBUG] Two of the dnd tests times out and failsGravatar Manukumar V S 2 months
pr/57768274550: c2i entry barriers read int as long on PPCGravatar Martin Doerr 2 months
pr/5774update copyright yearGravatar aoqi 2 months
pr/5775Trim down heap sizesGravatar Aleksey Shipilev 2 months
pr/5466The biggest problem i have is that the new logic reverts the mechanic of the ...Gravatar Artem Semenov 2 months
pr/5773Copyright yearGravatar Aleksey Shipilev 2 months
pr/5352Implemented the review comments.Gravatar Mahendra Chhipa 2 months
pr/57708274546: Shenandoah: Remove unused ShenandoahUpdateRootsTask copyGravatar Yude Lin 2 months
pr/5766Initial version JDK-8274304Gravatar mrserb 2 months
pr/5764Use align32Gravatar Jie Fu 2 months
pr/5745Revert wrong codeGravatar Hamlin-Li 2 months
pr/5765Minor cleanup.Gravatar Bradford Wetmore 2 months
pr/5728Update copyright years.Gravatar Joe Darcy 2 months
pr/5762Improve occupancy logging message for G1 IHOPGravatar Jonathan Joo 2 months
pr/57618274465: Some cleanupGravatar Alexey Ivanov 2 months
pr/5720Add explanatory comments for SuppressWarnings annotations.Gravatar Joe Darcy 2 months
pr/5759[PATCH] Cleanup usages of StringBuffer in java.xmlGravatar Andrey Turbanov 2 months
pr/5758FixGravatar Aleksey Shipilev 2 months
pr/5757FixGravatar Aleksey Shipilev 2 months
pr/5753[PATCH] Fix possible concurrency problem in FontDesignMetrics.KeyReference.di...Gravatar Andrey Turbanov 2 months
pr/5751[PATCH] Use String.equals instead of String.compareTo in java.desktopGravatar Andrey Turbanov 2 months
pr/5752[PATCH] Use String.equals instead of String.compareTo in jdk.accessibilityGravatar Andrey Turbanov 2 months
pr/5749Initial commitGravatar Pavel Rappo 2 months
pr/5621Clean up some stale test commentsGravatar Claes Redestad 2 months
pr/57508274506: TestPids.java and TestPidsLimit.java fail with podman run as rootGravatar Severin Gehwolf 2 months
pr/5755Merge branch 'master' into JDK-8274227_remove_impl_prefixGravatar Aleksei Efimov 2 months
pr/57548274501: c2i entry barriers read int as long on AArch64Gravatar Erik Österlund 2 months
pr/5740Check for podman version >= 3.3.1Gravatar Severin Gehwolf 2 months
pr/5731[PATCH] Too weak variable type leads to unnecessary cast in java.desktopGravatar Andrey Turbanov 2 months
pr/5568[PATCH] Unnecessary Vector usage in AquaFileSystemModelGravatar Andrey Turbanov 2 months
pr/5454[PATCH] Remove unnecessary castings in java.baseGravatar Andrey Turbanov 2 months
pr/5613Fixed commentGravatar Robbin Ehn 2 months
pr/3072remove trailing whitespacesGravatar Lin Zang 2 months
pr/5729dholmes reviewGravatar Kim Barrett 2 months
pr/5586addressing review commentsGravatar Vicente Romero 2 months
pr/57448274465: Mark javax/swing/text/ParagraphView/6364882/bug6364882.java as headfulGravatar Jie Fu 2 months
pr/5742v1Gravatar Patricio Chilano Mateo 2 months
pr/52618274050: Unnecessary Vector usage in javax.cryptoGravatar Andrey Turbanov 2 months
pr/5730Update copyrights.Gravatar Joe Darcy 2 months
pr/5547Merge branch 'asgibbons-align-fix' of https://github.com/asgibbons/jdk into a...Gravatar Scott Gibbons 2 months
pr/5739FixGravatar Aleksey Shipilev 2 months
pr/4992Add bug id to test.Gravatar Martin Doerr 2 months
pr/57478274406: RunThese30M.java failed "assert(!LCA_orig->dominates(pred_block) || ...Gravatar Christian Hagedorn 2 months
pr/5737JDK-8274434Gravatar MBaesken 2 months
pr/5647Remove thread blockingGravatar Prasanta Sadhukhan 2 months
pr/57358274383 JNI call of getAccessibleSelection on a wrong threadGravatar Artem Semenov 2 months
pr/57328274381 missing CAccessibility definitions in JNI codeGravatar Artem Semenov 2 months
pr/5733initial versionGravatar Thomas Schatzl 2 months
pr/51988248001: javadoc generates invalid HTML pages whose ftp:// links are brokenGravatar Yano, Masanori 2 months
pr/5734Revert "8271880: Tighten condition for excluding regions from collecting card...Gravatar Thomas Schatzl 2 months
pr/5596Exclude TestSerialGCWithCDS.java from hotspot_appcds_dynamic test groupGravatar iklam 2 months
pr/5723Add comments requested in code review.Gravatar Joe Darcy 2 months
pr/57278274401: C2: GraphKit::load_array_element bypasses Access APIGravatar Martin Doerr 2 months
pr/57258217501: Matcher.hitEnd returns false for incomplete surrogate pairsGravatar Ian Graves 2 months
pr/5719Update copyrights.Gravatar Joe Darcy 2 months
pr/57188274391: Suppress more warnings on non-serializable non-transient instance fi...Gravatar Joe Darcy 2 months
pr/5617adding comment explaining offset numbersGravatar Alisen Chung 2 months
pr/5681remove load barrier for JNI local rootsGravatar Lin Zang 2 months
pr/5716conservative fixGravatar rwestrel 2 months
pr/5715Initial commitGravatar Pavel Rappo 2 months
pr/5713Removing debug code.Gravatar Jan Lahoda 2 months
pr/5631Align the stars manuallyGravatar Aleksey Shipilev 2 months
pr/5712fix & testGravatar rwestrel 2 months
pr/5651Fix typoGravatar Christian Hagedorn 2 months
pr/5678Add @bugGravatar Christian Hagedorn 2 months
pr/5652Update UCT to Action_maybe_recompileGravatar Christian Hagedorn 2 months
pr/5701Use (R) and (TM)Gravatar Jie Fu 2 months
pr/5711Update AncestorResized.javaGravatar mrserb 2 months
pr/57108274345: make build-test-lib is brokenGravatar bobpengxie 2 months
pr/5698Merge branch 'master' into JDK-8274320-os-fork-and-exec-should-be-using-posix...Gravatar Thomas Stuefe 2 months
pr/5708[PATCH] Remove redundant 'null' comparison after Pattern.splitGravatar Andrey Turbanov 2 months
pr/5707[PATCH] Use Optional.isEmpty instead of !Optional.isPresent in jdk.jlinkGravatar Andrey Turbanov 2 months
pr/57068274330: Incorrect encoding of the DistributionPointName object in IssuingDis...Gravatar Weijun Wang 2 months
pr/5693address review commentsGravatar jpai 2 months
pr/5703Trigger botGravatar Erik Gahlin 2 months
pr/57028274326: [macos] Ensure initialisation of sun/lwawt/macosx/CAccessibility in ...Gravatar prrace 2 months
pr/4666code refineGravatar linzang 2 months
pr/57008274324: ProblemList jdk/jfr/api/consumer/TestRecordedFrameType.java on linux...Gravatar Daniel D. Daugherty 2 months
pr/5197Merge branch 'master' into 8272756Gravatar Sergey Tsypanov 2 months
pr/5699Initial commitGravatar Pavel Rappo 2 months
pr/52308272992: Replace usages of Collections.sort with List.sort call in jdk.* modulesGravatar Andrey Turbanov 2 months
pr/56978272992: Replace usages of Collections.sort with List.sort call in jdk.hotspo...Gravatar Andrey Turbanov 2 months
pr/56928274314: Typo in WatchService#poll(long timeout, TimeUnit unit) javadocGravatar jpai 2 months
pr/56918274313: ProblemList sun/tools/jmap/BasicJMapTest.java subtestsGravatar Daniel D. Daugherty 2 months
pr/5683Minor test adjustments as suggested by NaotoGravatar jpai 2 months
pr/5686Drop drop "Solaris" from the commentGravatar bobpengxie 2 months
pr/5690JDK-8274311: Make build.tools.jigsaw.GenGraphs more configurableGravatar Mandy Chung 2 months
pr/56898274255: Update javac messages to use "enum class" rather than "enum type"Gravatar Joe Darcy 2 months
pr/5644Simplify ToolBox.copyDirGravatar Jonathan Gibbons 2 months
pr/56878274296: Update or Problem List tests which may fail with uiScale=2 on macOSGravatar prrace 2 months
pr/5643Fixed absolute path issueGravatar Yumin Qi 2 months
pr/5676Update testing.html by handGravatar Jie Fu 2 months
pr/5419Fix commentGravatar Thomas Schatzl 2 months
pr/5680JDK-8274283Gravatar MBaesken 2 months
pr/56778274276: Make URLClassPath.Loader.getBaseURL() finalGravatar Sergey Tsypanov 2 months
pr/56798250678: ModuleDescriptor.Version parsing treats empty segments inconsistentlyGravatar Yano, Masanori 2 months
pr/5650ayang reviewGravatar Thomas Schatzl 2 months
pr/5037sjohanss review, additional verificationGravatar Thomas Schatzl 2 months
pr/56758274265: Suspicious string concatenation in test codeGravatar Jesper Steen Møller 2 months
pr/5674Hide "invalid entry" error messageGravatar Daniel Jelinski 2 months
pr/5673[PATCH] Use enhanced-for instead of plain 'for' in jdk.jcmdGravatar Andrey Turbanov 2 months
pr/56388274190: Use String.equals instead of String.compareTo in jdk.internal.jvmstatGravatar Andrey Turbanov 2 months
pr/5672whitespace errorGravatar Tongbao Zhang 2 months
pr/5615Another minor touchupGravatar Aleksey Shipilev 2 months
pr/5658Added Unavailable testGravatar Alexey Bakhtin 2 months
pr/5669Remove tests for special wait assert.Gravatar Coleen Phillimore 2 months
pr/56688274136: -XX:+ExitOnOutOfMemoryError calls exit while threads are runningGravatar David Holmes 2 months
pr/5667JDK-8274233: Minor cleanup for ToolBoxGravatar Jonathan Gibbons 2 months
pr/5671Merge branch 'master' into JDK-8273972Gravatar mrserb 2 months
pr/5665[PATCH] Replace 'for' cycles with iterator with enhanced-for in java.baseGravatar Andrey Turbanov 2 months
pr/5664JdbTest.redefineClass updates source pathGravatar Alex Menkov 2 months
pr/52648273299: Unnecessary Vector usage in java.security.jgssGravatar Andrey Turbanov 2 months
pr/5662[PATCH] Remove unnecessary boxing via primitive wrapper valueOf(String) metho...Gravatar Andrey Turbanov 2 months
pr/56618273634: [TEST_BUG] Improve javax/swing/text/ParagraphView/6364882/bug6364882...Gravatar Alexey Ivanov 2 months
pr/5663 JDK-8274087: Windows DLL path not set correctly.Gravatar Andy Herrick 2 months
pr/56608239502: Make sure -saveAll saves all the imagesGravatar Alexey Ivanov 2 months
pr/56598274232: Cleanup unnecessary null comparison before instanceof check in jdk.jdiGravatar Andrey Turbanov 2 months
pr/56578274216: ProblemList 2 serviceability/dcmd/gc tests with ZGC on linux-all and...Gravatar Daniel D. Daugherty 2 months
pr/5655Removing trailing whitespace.Gravatar Jan Lahoda 2 months
pr/5584Moved _base_archive_name_size to CDSFileMapHeaderBase and made checking consi...Gravatar Yumin Qi 2 months
pr/5543Add JBS issue `8262944` to the `@bug` list and update copyright yearGravatar Christian Stein 2 months
pr/56538273618: DisplayChangeVITest.java is timing out on macOS 12 aarch64Gravatar Prasanta Sadhukhan 2 months
pr/5649Revert "Standardize wording in FileVisitResult constants"Gravatar Pavel Rappo 2 months
pr/5379Move out bxGravatar Aleksey Shipilev 2 months
pr/55788274016: Replace 'for' cycles with iterator with enhanced-for in java.desktopGravatar Andrey Turbanov 2 months
pr/5656initial changeGravatar Julia Boes 2 months
pr/5648FixGravatar Aleksey Shipilev 2 months
pr/56408274168: Avoid String.compareTo == 0 to check String equality in java.managementGravatar Andrey Turbanov 2 months
pr/56468272968: AArch64: Remove redundant matching rules forGravatar Fei Gao 2 months
pr/5666Initial changeGravatar M. Seledtsov 2 months
pr/56428274175: (fc) java/nio/channels/FileChannel/Transfer2GPlus.java still failed ...Gravatar Brian Burkhalter 2 months
pr/5402Added htbl_entries constant to other architecturesGravatar svkamath 2 months
pr/56418274169: HotSpot Style Guide has stale link to chromium style guideGravatar Liam Miller-Cushon 2 months
pr/5406refactoringGravatar Vicente Romero 2 months
pr/56398267636: Bump minimum boot jdk to JDK 17Gravatar Mikael Vidstedt 2 months
pr/5637[PATCH] Use String.equals instead of String.compareTo to check String's equal...Gravatar Andrey Turbanov 2 months
pr/5636[PATCH] Cleanup redundant casts, when type is actually known beforehandGravatar Andrey Turbanov 2 months
pr/5633Check for missing version from SystemVersion plist.Gravatar Roger Riggs 2 months
pr/5634Improve enqueueMethodForCompilationGravatar Erik Gahlin 2 months
pr/5626fixed typo; removed fix for handling of CDSUtils::getRuntimePrefix() to be do...Gravatar iklam 2 months
pr/5610Add missing "the"Gravatar Pavel Rappo 2 months
pr/52748238274: (sctp) JDK-7118373 is not fixed for SctpChannelGravatar Yano, Masanori 2 months
pr/5606Update test_codestrings.cppGravatar Patric Hedlin 2 months
pr/5372Revert "Implement Mark's suggestion in CSR to include the java.properties.dat...Gravatar jpai 2 months
pr/5630[PATCH] Replace 'while' cycles with iterator with enhanced-for in jdk.hotspot...Gravatar Andrey Turbanov 2 months
pr/5629[PATCH] Unused ArrayList is created in RequestEngine.addHooksGravatar Andrey Turbanov 2 months
pr/5628[PATCH] Remove unused Modules.extraLimitModsGravatar Andrey Turbanov 2 months
pr/56278274120: [JVMCI] CompileBroker should resolve parameter types for JVMCI compilesGravatar Tom Rodriguez 2 months
pr/56328273894: ConcurrentModificationException raised every time ReferralsCache dro...Gravatar jpai 2 months
pr/5546JDK-8273881-metaspace-test-repeated-deallocsGravatar tstuefe 2 months
pr/56258218885: Restore pop_frame and force_early_return functionality for GraalGravatar Tom Rodriguez 2 months
pr/5563Remove special comment.Gravatar Coleen Phillimore 2 months
pr/5611Removed the unnecessary spaceGravatar Naoto Sato 2 months
pr/5353Merge branch 'master' into touch_memoryGravatar Kim Barrett 2 months
pr/5144Merge branch 'master' into permit_lambdaGravatar Kim Barrett 2 months
pr/56208273546: DecimalFormat documentation contains literal HTML character referencesGravatar Naoto Sato 2 months
pr/56198269850: Most JDK releases report macOS version 12 as 10.16 instead of 12.0Gravatar Roger Riggs 2 months
pr/56188274003: ProcessHandleImpl.Info toString has an if check which is always trueGravatar Roger Riggs 2 months
pr/5607kbarrett review; fix comment, includesGravatar Thomas Schatzl 3 months
pr/5612FixGravatar Aleksey Shipilev 3 months
pr/5614JDK-8270156: Add randomness and stress keys to JTreg tests which use StressGC...Gravatar Tobias Holenstein 3 months
pr/5609Initial commitGravatar Pavel Rappo 3 months
pr/56088274070: Rectify problemlist platform for failing test on macos12Gravatar Prasanta Sadhukhan 3 months
pr/5605renameGravatar Thomas Schatzl 3 months
pr/4795Merge branch 'master' into 8266666Gravatar Pavel Rappo 3 months
pr/55748273961: jdk/nio/zipfs/ZipFSTester.java fails if file path contains '+' chara...Gravatar sunxu 3 months
pr/5392Create implcit exceptions with an array of StackTraceElements right away inst...Gravatar Volker Simonis 3 months
pr/5603Some indentation fixesGravatar Thomas Schatzl 3 months
pr/56028274056 JavaAccessibilityUtilities leaks JNI objects - Java Bug SystemGravatar Artem Semenov 3 months
pr/5601JDK-8267853: Remove unused styles from stylesheetGravatar Hannes Wallnoefer 3 months
pr/5599JDK-8272703: RepeatCompilation check addedGravatar Tobias Holenstein 3 months
pr/56048270139: jshell InternalError crash for import of @Repeatable followed by unr...Gravatar Jan Lahoda 3 months
pr/55238273646: Add openssl from path variable also in to Default System Openssl Pat...Gravatar Thejasvi Voniadka 3 months
pr/5517Add final keyword to PlatformFontInfo classGravatar AlexanderScherbatiy 3 months
pr/55988206438: com/sun/jdi/FieldWatchpoints.java timeout intermittentlyGravatar fmatte 3 months
pr/5597[PATCH] Remove reentrant synchronized block in java.awt.Cursor.loadSystemCust...Gravatar Andrey Turbanov 3 months
pr/5582Restored javaTimeNanos_info in os-files, adjusted clock_tics_per_sec initGravatar MBaesken 3 months
pr/5515fixed line numbers after Idea autoimport.Gravatar lmesnik 3 months
pr/55938272759: (fc) java/nio/channels/FileChannel/Transfer2GPlus.java failed in tim...Gravatar Brian Burkhalter 3 months
pr/55898274029 : Remove jtreg tag manual=yesno for java/awt/print/Dialog/DialogOrien...Gravatar lawrence.andrews 3 months
pr/5550Add comment and change enum name to Rank.Gravatar Coleen Phillimore 3 months
pr/5587Update MTTransformReplacedProfile.javaGravatar Sergey Bylokhov 3 months
pr/55858274024: Use regular accessors to internal fields of oopDescGravatar Roman Kennke 3 months
pr/5579fix minor typoGravatar Lance Andersen 3 months
pr/5570Updated problem list for XcompGravatar M. Seledtsov 3 months
pr/5320Rename JarConstraintsParameter.init to addToCertsAndKeys. Add more commentsGravatar Sean Mullan 3 months
pr/5560Update t105.javaGravatar Nils Eliasson 3 months
pr/5583Fixed random crashes at VM exit by reverting JDK-8273605 (02af541b7427a4b74ee...Gravatar Thomas Schatzl 3 months
pr/5239The switch from a Java child to /bin/sleep caused another testGravatar Roger Riggs 3 months
pr/5557Merge remote-tracking branch 'origin/master' into 8273928_jtreg_idsGravatar Stefan Karlsson 3 months
pr/5581Reduce unnecessary BadPaddingExceptions that are created in success pathGravatar Lari Hotari 3 months
pr/55768273965: some testlibrary_tests/ir_framework tests fail when c1 disabledGravatar aoqi 3 months
pr/5573JDK-8273959-Some-metaspace-diagnostic-switches-should-be-developGravatar tstuefe 3 months
pr/5572removeGravatar Yi Yang 3 months
pr/5571JDK-8273958-gtest-MetaspaceGtests-executes-unnecessary-tests-in-debug-buildsGravatar tstuefe 3 months
pr/5518MergeGravatar tstuefe 3 months
pr/5567Fixed getEventSetForThreadStartDeath and its callersGravatar Alex Menkov 3 months
pr/4850minor change in instructionGravatar lawrence.andrews 3 months
pr/55668273505: runtime/cds/appcds/loaderConstraints/DynamicLoaderConstraintsTest.ja...Gravatar Calvin Cheung 3 months
pr/5565[PATCH] Use String.contains() instead of String.indexOf() in java.desktopGravatar Andrey Turbanov 3 months
pr/5540Simplification proposed by Thomas StuefeGravatar MBaesken 3 months
pr/5503Fixed review commentsGravatar lawrence.andrews 3 months
pr/55648273578: javax/swing/JMenu/4515762/bug4515762.java fails on macOS 12Gravatar Prasanta Sadhukhan 3 months
pr/5559[PATCH] Use String.contains() instead of String.indexOf() in java.baseGravatar Andrey Turbanov 3 months
pr/5558FixGravatar Aleksey Shipilev 3 months
pr/55568273929: Remove GzipRandomAccess in heap dump testGravatar Lin Zang 3 months
pr/4122Merge with masterGravatar Ningsheng Jian 3 months
pr/5459Fix typoGravatar Kartik Ohri 3 months
pr/55198273774: CDSPluginTest should only expect classes_nocoops.jsa exists on suppo...Gravatar sunxu 3 months
pr/5554Add threadControl_dumpThread()Gravatar Chris Plummer 3 months
pr/55538273913: Problem list some headful client jtreg tests that fail on macOS 12Gravatar prrace 3 months
pr/5552[PATCH] Cleanup unnecessary calls to Throwable.initCause() in java.managementGravatar Andrey Turbanov 3 months
pr/5357Merge branch 'master' into JDK-8273314-tier4Gravatar Aleksey Shipilev 3 months
pr/5551[PATCH] Cleanup unnecessary calls to Throwable.initCause() in java.base moduleGravatar Andrey Turbanov 3 months
pr/5403@TobiHartmann's commentsGravatar Zhengyu Gu 3 months
pr/5539Merge branch 'master' into JDK-8273187Gravatar Naoto Sato 3 months
pr/5458add back a blank line to jvm.cppGravatar Calvin Cheung 3 months
pr/5549JDK-8273902: Memory leak in OopStorage due to bug in OopHandle::release()Gravatar Volker Simonis 3 months
pr/55488273895: compiler/ciReplay/TestVMNoCompLevel.java fails due to wrong data siz...Gravatar Christian Hagedorn 3 months
pr/5524Remove redundant checkGravatar seanwxiang 3 months
pr/5506address PR comments and refactor testGravatar Julia Boes 3 months
pr/5541Fix commentGravatar Per Liden 3 months
pr/55558273825: TestIRMatching.java fails after JDK-8266550 on aarch64Gravatar Christian Hagedorn 3 months
pr/5511Add test cases about unknown type and annotation.Gravatar Guoxiong Li 3 months
pr/5375remove tracemsgGravatar Albert Yang 3 months
pr/5545FixGravatar Aleksey Shipilev 3 months
pr/5561JDK-8273877Gravatar MBaesken 3 months
pr/5544FixGravatar Aleksey Shipilev 3 months
pr/2261fix build issueGravatar linzang 3 months
pr/5542[PATCH] Avoid redundant Math.min/Math.max calls in DefaultHighlighterGravatar Andrey Turbanov 3 months
pr/5538Fixed test to handle events from system threadsGravatar Alex Menkov 3 months
pr/5514added range(0,2) for VerifyArchivedFieldsGravatar iklam 3 months
pr/5467Remove safepoint conditional from other assert. The locks should now be in de...Gravatar Coleen Phillimore 3 months
pr/5535Add requires labelGravatar Thomas Schatzl 3 months
pr/5533FixGravatar Aleksey Shipilev 3 months
pr/5532JDK-8273808Gravatar MBaesken 3 months
pr/5531FixGravatar Aleksey Shipilev 3 months
pr/5530FixGravatar Aleksey Shipilev 3 months
pr/5529FixGravatar Aleksey Shipilev 3 months
pr/5528FixGravatar Aleksey Shipilev 3 months
pr/5527FixGravatar Aleksey Shipilev 3 months
pr/5525FixGravatar Aleksey Shipilev 3 months
pr/5526FixGravatar Aleksey Shipilev 3 months
pr/5437Adjust TestPidsGravatar MBaesken 3 months
pr/5520[PATCH] Remove redundant stream() call before forEach in java.* modulesGravatar Andrey Turbanov 3 months
pr/55008273711: Remove redundant stream() call before forEach in jdk.jlinkGravatar Andrey Turbanov 3 months
pr/5450Include stddef.h in cds.hGravatar Yumin Qi 3 months
pr/5516MergeGravatar Serguei Spitsyn 3 months
pr/5512dummy commitGravatar Alexey Semenyuk 3 months
pr/5401alphabetized importsGravatar Alisen Chung 3 months
pr/5390CleanupGravatar theRealAph 3 months
pr/5509JDK-8273040: Turning off JpAllowDowngrades (or Upgrades)Gravatar Andy Herrick 3 months
pr/55088273730: WorkGangBarrierSync constructor unusedGravatar Coleen Phillimore 3 months
pr/5507InitialGravatar Erik Gahlin 3 months
pr/5376Even more conservative patchGravatar Aleksey Shipilev 3 months
pr/5487JDK-8272771: removed call to print_on() in debug::ps()Gravatar Tobias Holenstein 3 months
pr/5495Remove the new parameterGravatar Guoxiong Li 3 months
pr/55048273691: Missing comma after 2021 in GraphemeTestAccessor.java copyright noticeGravatar David Holmes 3 months
pr/5499fix typoGravatar Coleen Phillimore 3 months
pr/55028273641: (bf) Buffer subclasses documentation contains template stringsGravatar Brian Burkhalter 3 months
pr/5498[PATCH] Remove redundant stream() call before forEach in jdk.jdepsGravatar Andrey Turbanov 3 months
pr/5430Factoring out Math.pow for squaresGravatar Ian Graves 3 months
pr/5494InitialGravatar Erik Gahlin 3 months
pr/5493Notify everyone to abort at VM exit instead of waiting until marking finishes.Gravatar Thomas Schatzl 3 months
pr/5473MergeGravatar Zhengyu Gu 3 months
pr/5463Fix constructor callGravatar Per Liden 3 months
pr/54928273639: tests fail with "assert(_handle_mark_nesting > 1) failed: memory lea...Gravatar Per Liden 3 months
pr/5490replay fixGravatar rwestrel 3 months
pr/5475Use "ensure" instead of "insure"Gravatar Pavel Rappo 3 months
pr/54898273656: Improve java.lang.invoke.MethodType.parameterList() and its usageGravatar Sergey Tsypanov 3 months
pr/5477Remove unused importsGravatar Erik Gahlin 3 months
pr/5310Disable invertedIcon icon tooGravatar Prasanta Sadhukhan 3 months
pr/5470Add commentsGravatar Aleksey Shipilev 3 months
pr/5407Fix commentsGravatar Yasumasa Suenaga 3 months
pr/5485Update bug4235420.javaGravatar mrserb 3 months
pr/5484InitialGravatar Erik Gahlin 3 months
pr/54798273629: compiler/uncommontrap/TestDeoptOOM.java fails with release VMsGravatar Jie Fu 3 months
pr/5476Fix whitespacesGravatar Erik Gahlin 3 months
pr/5368Removed unnecessary UsePerfData per review feedbackGravatar M. Seledtsov 3 months
pr/5425Refactoring test to whiteboxGravatar Ian Graves 3 months
pr/5457Reflecting review comment.Gravatar Naoto Sato 3 months
pr/53418271602: Add Math.ceilDiv() family parallel to Math.floorDiv() familyGravatar Raffaello Giulietti 3 months
pr/5474remove stray commentGravatar Coleen Phillimore 3 months
pr/5471Initial commitGravatar Pavel Rappo 3 months
pr/54728273610: LogTestFixture::restore_config() should not restore optionsGravatar iklam 3 months
pr/5469Remove cross_thresholdGravatar Thomas Schatzl 3 months
pr/3880Merge branch 'master' into JDK-8266550Gravatar rwestrel 3 months
pr/53738273355: Lanai: Flickering on tooltip appearance IntelliJ IDEA 2021.2.1Gravatar Alexey Ushakov 3 months
pr/5428Per's commentGravatar Zhengyu Gu 3 months
pr/5462copyright year update and less importGravatar aoqi 3 months
pr/5354Merge branch 'master' into JDK-8273259Gravatar Naoto Sato 3 months
pr/5461Move post evacuate helper classes to cpp fileGravatar Thomas Schatzl 3 months
pr/54608233674: JarURLConnection.getJarFile throws Exception if some process is hold...Gravatar Yano, Masanori 3 months
pr/54658273584: TypeElement.getSuperclass crashes for a record TypeElement when j.l....Gravatar Jan Lahoda 3 months
pr/5294[PATCH] Stack usages can be replaced with ArrayDequeueGravatar Andrey Turbanov 3 months
pr/5266changeGravatar Yi Yang 3 months
pr/5439Merge branch 'openjdk:master' into thread_priorityGravatar kabutz 3 months
pr/54268273513: Remove an extra spaceGravatar Brian Burkhalter 3 months
pr/54568273402: Remove redundant catch statement, change comment to match fixGravatar Aleksei Efimov 3 months
pr/5410Remove assertsGravatar Per Liden 3 months
pr/5453InitialGravatar Erik Gahlin 3 months
pr/54528256977: Bump minimum GCC from 5.x to 6 for JDKGravatar Magnus Ihse Bursie 3 months
pr/54558273522: Rename test property vm.cds.archived.java.heap to vm.cds.write.archi...Gravatar iklam 3 months
pr/54518273497: building.md should link to both md and htmlGravatar Magnus Ihse Bursie 3 months
pr/5424Implement review commentsGravatar Sandhya Viswanathan 3 months
pr/54458273456: Do not hold ttyLock around stack walkingGravatar Coleen Phillimore 3 months
pr/5442Updated gtestsGravatar Per Liden 3 months
pr/53748273484: Cleanup unnecessary null comparison before instanceof check in java....Gravatar Andrey Turbanov 3 months
pr/54448273550: Replace os::cgc_thread/pgc_thread with os::gc_threadGravatar Per Liden 3 months
pr/5415Improve guard against invalid typeGravatar Erik Gahlin 3 months
pr/53318273278: Improving XSLT support for GraalVM's Native Image.Gravatar jovanstevanovic 3 months
pr/54418263773: Request for German localization in Java 11Gravatar svijayasekar 3 months
pr/5440FixGravatar Aleksey Shipilev 3 months
pr/54388273539: [PPC64] gtest build error after JDK-8264207Gravatar Martin Doerr 3 months
pr/5414Refine commentsGravatar Hamlin-Li 3 months
pr/5435JDK-8272771: removed dead returns_long()Gravatar Tobias Holenstein 3 months
pr/5434Check BigSurOrAboveGravatar Prasanta Sadhukhan 3 months
pr/5436fix for JDK-8273135Gravatar Sergey Bylokhov 3 months
pr/54318273498: compiler/c2/Test7179138_1.java timed outGravatar Tobias Hartmann 3 months
pr/5427Merge branch 'master' into JDK-8273188Gravatar Naoto Sato 3 months
pr/54238271569: Rename cdsoffsets.cpp to cdsConstants.cppGravatar Yumin Qi 3 months
pr/5396Corrected the calculation for MILLIS as well.Gravatar Naoto Sato 3 months
pr/54208273358: macOS Monterey does not have the font Times needed by SerifGravatar prrace 3 months
pr/5418Added missing IgnoreUnrecognizedVMOptionsGravatar Tobias Hartmann 3 months
pr/54178273497: Change from testing.html to testing.mdGravatar Dan Heidinga 3 months
pr/5335Simplify file deletionGravatar Roger Riggs 3 months
pr/5416FixGravatar Aleksey Shipilev 3 months
pr/5413Build system awkwardness ensuesGravatar Aleksey Shipilev 3 months
pr/5384remove declarationGravatar MBaesken 3 months
pr/5412FixGravatar Aleksey Shipilev 3 months
pr/5325Fix merge issueGravatar Hamlin-Li 3 months
pr/5165Reflecting review comments.Gravatar Jan Lahoda 3 months
pr/5411FixGravatar Aleksey Shipilev 3 months
pr/53568273375: Remove redundant 'new String' calls after concatenation in java.desktopGravatar Andrey Turbanov 3 months
pr/5381No need for Scanner import anymoreGravatar Aleksey Shipilev 3 months
pr/5358Go "manual"Gravatar Aleksey Shipilev 3 months
pr/54098273478: [macos11] JTabbedPane selected and pressed tab is not legibleGravatar Prasanta Sadhukhan 3 months
pr/5397shade reviewGravatar Thomas Schatzl 3 months
pr/5408JDK-8272698: LoadNode::pin is unusedGravatar Tobias Holenstein 3 months
pr/5383Some minor changesGravatar seanwxiang 3 months
pr/53998273450: Fix the copyright header of SVML fileGravatar Sandhya Viswanathan 3 months
pr/53988273451Gravatar lmesnik 3 months
pr/53958273359: assert(flat == flatten_alias_type(flat)) failed: not idempotentGravatar Vladimir Ivanov 3 months
pr/5394FixGravatar Aleksey Shipilev 3 months
pr/5393Fix forward declarations and includesGravatar Thomas Schatzl 3 months
pr/5391Remove TEST.propertiesGravatar Aleksey Shipilev 3 months
pr/5209Added comma after year in copyrightGravatar Markus Karg 3 months
pr/5388Update module-info.javaGravatar JimLaskey 3 months
pr/5332templateGravatar Albert Yang 3 months
pr/45948269373: some tests in jdk/tools/launcher/ fails on localized Windows platformGravatar Yano, Masanori 3 months
pr/5389Remove TEST.propertiesGravatar Aleksey Shipilev 3 months
pr/53858273414: ResourceObj::operator delete should handle nullptr in debug buildsGravatar Leo Korinth 3 months
pr/5272Fix merging issuesGravatar Hamlin-Li 3 months
pr/5293Fix condition for error streamGravatar Yasumasa Suenaga 3 months
pr/4472whitespaces removedGravatar frkator 3 months
pr/5360JDK-8273034: tweak button heightGravatar Hannes Wallnoefer 3 months
pr/5259Refactor has_wide_memGravatar Vladimir Ivanov 3 months
pr/5382remove redundant codeGravatar Kim Barrett 3 months
pr/5380JDK-8273312 : sanity/client/SwingSet/src/ButtonDemoScreenshotTest.java fails ...Gravatar Amresh Sahu 3 months
pr/5377Update copyrightGravatar Aleksey Shipilev 3 months
pr/5378FixGravatar Aleksey Shipilev 3 months
pr/5333Removed obsolete fileGravatar Thomas Schatzl 3 months
pr/5217Use NonFocus colorGravatar Prasanta Sadhukhan 3 months
pr/5363Change the @requries line orderGravatar Aleksey Shipilev 3 months
pr/5370JDK-8272192 Shortcut String equality checks by checking equality of the value...Gravatar vasilii startsev 3 months
pr/5366JDK-8273246 fix logic error in testReceive method change reader.send to sende...Gravatar Mark Sheppard 3 months
pr/5362Explicitly mark as StackObj subclassGravatar Dan Heidinga 3 months
pr/53678255878: Add @implSpec where appropriateGravatar Brian Burkhalter 3 months
pr/5339Remove extra spaceGravatar Tom Rodriguez 3 months
pr/5338Fixed year in copyrightGravatar lawrence.andrews 3 months
pr/5194Merge branch 'master' of https://github.com/openjdk/jdk into 8265489Gravatar lmesnik 3 months
pr/5365ImplementGravatar Aleksey Shipilev 3 months
pr/53648273332: [Vector API] C2 fails to check whether the rotate operation is direc...Gravatar Jie Fu 3 months
pr/5281Remove disturbing white-space.Gravatar Patric Hedlin 3 months
pr/5246Address review commentsGravatar Vladimir Ivanov 3 months
pr/5224addressing review commentsGravatar Vicente Romero 3 months
pr/53618273329: Remove redundant null check from String.getBytes(String charsetName)Gravatar Sergey Tsypanov 3 months
pr/5359Try larger memoriesGravatar Aleksey Shipilev 3 months
pr/5350increase probability in testGravatar mgronlun 3 months
pr/5220test fixGravatar rwestrel 3 months
pr/46808271603: Unnecessary Vector usage in java.desktopGravatar Andrey Turbanov 3 months
pr/51588272611: change heapInspection thread num in ClassHistogramDCmd::executeGravatar Bin Liao 3 months
pr/5295fix initialization of _legacyGCLoggingGravatar Xiaowei Lu 3 months
pr/5355[PATCH] Use ByteArrayOutputStream.toString to convert its content to the StringGravatar Andrey Turbanov 3 months
pr/5343review commentGravatar Mandy Chung 3 months
pr/2496More natural order of argumentsGravatar Aleksey Shipilev 3 months
pr/4944Merge with masterGravatar Thomas Schatzl 3 months
pr/5258Update the commentGravatar Vladimir Ivanov 3 months
pr/5351use param specClassGravatar Fernando Guallini 3 months
pr/5306Move ext root scan subphases to proper locationGravatar Thomas Schatzl 3 months
pr/53498273263: Incorrect recovery attribution of record component type when j.l.Rec...Gravatar Jan Lahoda 3 months
pr/5347Adjust commentsGravatar MBaesken 3 months
pr/53488273257: jshell doesnt compile a sealed hierarchy with a sealed interface and...Gravatar Jan Lahoda 3 months
pr/5142Add more debug infomationGravatar casparcwang 3 months
pr/53468273234: extended 'for' with expression of type tvar causes the compiler to c...Gravatar Vicente Romero 3 months
pr/5326Some tests deletedGravatar mrserb 3 months
pr/53458273256: runtime/cds/appcds/TestEpsilonGCWithCDS.java fails due to Unrecogniz...Gravatar Jie Fu 3 months
pr/53368273243: looks -> looks likeGravatar Aleksei Efimov 3 months
pr/5342v1Gravatar Patricio Chilano Mateo 3 months
pr/53448273240: Dynamic test ArchiveConsistency.java should use CDSArchiveUtilsGravatar Yumin Qi 3 months
pr/4674Fixing compensation testGravatar Ian Graves 3 months
pr/5340Address JDK-8273250Gravatar Lance Andersen 3 months
pr/5309Update copyrigth years.Gravatar Joe Darcy 3 months
pr/5203Revert NonJavaThreads_lock rank.Gravatar Coleen Phillimore 3 months
pr/5249Assert is too strongGravatar Vladimir Ivanov 3 months
pr/5330Migrate to Type::maybe_null()Gravatar Vladimir Ivanov 3 months
pr/4728Notify only when unwinding messages are receivedGravatar Aleksey Shipilev 3 months
pr/5313Merge remote-tracking branch 'origin/master' into redundant_boxing_in_java.de...Gravatar Andrey Turbanov 3 months
pr/5241Add newly emerged tier2_gc_epsilon to tier2 as wellGravatar Aleksey Shipilev 3 months
pr/5250Merge branch 'master' into JDK-8272970-parallel-invocation-testsGravatar Aleksey Shipilev 3 months
pr/5328[PATCH] Replace while cycles with iterator with enhanced-for in java.baseGravatar Andrey Turbanov 3 months
pr/51648272563: Possible assertion failure in CardTableBarrierSetC1Gravatar fmatte 3 months
pr/53238273217: Make ParHeapInspectTask _safepoint_check_neverGravatar Coleen Phillimore 3 months
pr/5324MergeGravatar Jamil Nimeh 3 months
pr/5074Merge branch 'master' into 8270489-archived-heap-objects-for-epsilon-gcGravatar iklam 3 months
pr/5135Fix merge mistake.Gravatar John Tortugo 3 months
pr/53228273206: jdk/jfr/event/gc/collection/TestG1ParallelPhases.java fails after JD...Gravatar Jie Fu 3 months
pr/5210Merge branch 'master' into standard-encodings-in-non-public-modulesGravatar mrserb 3 months
pr/53038273140: Fix copyright yearGravatar Sergey Tsypanov 3 months
pr/5269Skip macOS: can't disable text antialiasingGravatar Alexey Ivanov 3 months
pr/5319Remove obsoleteGravatar Thomas Schatzl 3 months
pr/5242reviewGravatar Albert Yang 3 months
pr/5449Correct the loop conditionGravatar JimLaskey 3 months
pr/53188271287: jdk/jshell/CommandCompletionTest.java fails with "lists don't have t...Gravatar Jan Lahoda 3 months
pr/5317JDK-8273176Gravatar MBaesken 3 months
pr/5316solve Whitespace errorGravatar seanwxiang 3 months
pr/5329gcidGravatar Albert Yang 3 months
pr/5314Some more refactorngGravatar Thomas Schatzl 3 months
pr/5282Thomas reviewGravatar Ivan Walulya 3 months
pr/53158273169: java/util/regex/NegativeArraySize.java failed after JDK-8271302Gravatar bobpengxie 3 months
pr/53118272968: AArch64: Remove redundant matching rules for commutative opsGravatar Faye Gao 3 months
pr/5204sections etcGravatar Weijun Wang 3 months
pr/5288@dfuch commentsGravatar iklam 3 months
pr/5270rename LocPusher --> RecordLocation, add commentsGravatar Dean Long 3 months
pr/5257rename one variableGravatar Weijun Wang 3 months
pr/53088273153: Consolidate file_exists into os:file_existsGravatar Yumin Qi 3 months
pr/5226Merge branch 'master' into JDK-8272347Gravatar Vicente Romero 3 months
pr/53058273148: Shouldn't increment _ifop_count when IfOp is createdGravatar Denghui Dong 3 months
pr/53078262095: NPE in Flow.visitApply: Cannot invoke getThrownTypes because tree.me...Gravatar Vicente Romero 3 months
pr/5092Removing some notes re JUnit5Gravatar Ian Graves 3 months
pr/5304Remove unused log entryGravatar Thomas Schatzl 3 months
pr/5302typoGravatar Ivan Walulya 3 months
pr/53128272776: NullPointerException not reportedGravatar Jan Lahoda 3 months
pr/5047Merge branch 'master' into 8272093-extract-evac-failure-injectorGravatar Thomas Schatzl 3 months
pr/5252Albert review.Gravatar Stefan Johansson 3 months
pr/5300Restore JFR update missing in markdown sourceGravatar David Holmes 3 months
pr/5291Simplify and call getBytes(String, int, byte) when possibleGravatar Claes Redestad 3 months
pr/5299Shenandoah: Adopt relaxed order for update oopGravatar Xiaowei Lu 3 months
pr/5298ZGC: Load forwardee without acquire semanticsGravatar Hao Tang 3 months
pr/4722fix windows build failedGravatar Wanghuang-Huawei 3 months
pr/5292Initial fix of JDK-8273102Gravatar mrserb 3 months
pr/4733Fixed a failing testGravatar Naoto Sato 3 months
pr/52878273091: Doc of [Strict]Math.floorDiv(long,int) erroneously documents int in ...Gravatar Raffaello Giulietti 3 months
pr/52866859027: Duplicate communications to KDC in GSSManager.createCredential(usage)Gravatar Weijun Wang 3 months
pr/5283[PATCH] Cleanup redundant casts, when type is actually known beforehandGravatar Andrey Turbanov 3 months
pr/52848272915: (doc) package-info typo in extLinkGravatar Bradford Wetmore 3 months
pr/52858271602: Add Math.ceilDiv() family parallel to Math.floorDiv() familyGravatar Raffaello Giulietti 3 months
pr/5277mistake in last commitGravatar Michael-Mc-Mahon 3 months
pr/5218Reverse the order of safepoint_check_required and allow_vm_block arguments so...Gravatar Coleen Phillimore 3 months
pr/52808229031: Exporting CLASSPATH from shell can result in build failuresGravatar Magnus Ihse Bursie 3 months
pr/52788258465: Headless build fails due to missing X11 headers on linuxGravatar Magnus Ihse Bursie 3 months
pr/5219Make sure CriticalJNI tests are in tier2 in both Epsilon and Shenandoah blocksGravatar Aleksey Shipilev 3 months
pr/52768273072: Avoid using += in configureGravatar Magnus Ihse Bursie 3 months
pr/5185Changing to enumGravatar Christian Hagedorn 3 months
pr/5275remove unused declarationsGravatar Kim Barrett 3 months
pr/52718273045: Fix misc javadoc bugs in the java.security and javax.net.ssl codeGravatar Bradford Wetmore 3 months
pr/5256Fix test.Gravatar Coleen Phillimore 3 months
pr/5234No need to normalize nextFloatGravatar Sandhya Viswanathan 3 months
pr/5268Set initialized to trueGravatar matias9927 3 months
pr/5267trivialGravatar Albert Yang 3 months
pr/2803Merge branch 'master' into sadump-fixGravatar Lin Zang 3 months
pr/52658273020: LibraryCallKit::sharpen_unsafe_type does not handle narrow oop arrayGravatar Tobias Hartmann 3 months
pr/5262[PATCH] Unnecessary Vector usage in java.namingGravatar Andrey Turbanov 3 months
pr/52608272964: java/nio/file/Files/InterruptCopy.java fails with java.lang.RuntimeE...Gravatar Brian Burkhalter 3 months
pr/52278262751: RenderPipelineState assertion error in J2DDemoGravatar Alexey Ushakov 3 months
pr/46428268788: Filter out synthetic methods from the member methods computationGravatar Sergei Ustimenko 3 months
pr/5151Merge branch 'JDK-8267188-string-intern' of github.com:zhengyu123/jdk into JD...Gravatar Zhengyu Gu 3 months
pr/51728272481: [macos] javax/swing/JFrame/NSTexturedJFrame/NSTexturedJFrame.java failsGravatar Alexey Ushakov 3 months
pr/5214Make the timeout depend on global timeout with lower multiplierGravatar Aleksey Shipilev 3 months
pr/5279Correct table entriesGravatar JimLaskey 3 months
pr/52548272983: G1 Add marking details to eager reclaim loggingGravatar Ivan Walulya 3 months
pr/4753fix direct server and plain http proxy auth that became inadvertently brokenGravatar Alex Kashchenko 3 months
pr/52538272859: Javadoc external links should only have feature version number in URLGravatar Magnus Ihse Bursie 3 months
pr/5121Review CommentsGravatar Pankaj Bansal 3 months
pr/5251clean upGravatar Ivan Walulya 3 months
pr/5247heap-docGravatar Albert Yang 3 months
pr/52488272973: Incorrect compile command used by TestIllegalArrayCopyBeforeInfinite...Gravatar Tobias Hartmann 3 months
pr/4885Update manpage of javaGravatar Yasumasa Suenaga 3 months
pr/5178Add testGravatar Prasanta Sadhukhan 3 months
pr/52458272343: Remove MetaspaceClosure::FLAG_MASKGravatar iklam 3 months
pr/5221new APIs and new examplesGravatar Weijun Wang 3 months
pr/5244JDK-8272375: Improve phrasing of synthesized descriptions in JavaFX docsGravatar Jonathan Gibbons 3 months
pr/52408272916: Copyright year was modified unintentionally in jlink.properties and ...Gravatar Calvin Cheung 3 months
pr/4861Return null if printers are not found in sandboxed app on MacOSGravatar AlexanderScherbatiy 3 months
pr/5238Inlining should not depend on absolute call site countsGravatar Igor Veresov 3 months
pr/5118Merge branch 'master' into remove_shared_dcq_lockGravatar Kim Barrett 3 months
pr/5213trailing spaceGravatar Ivan Walulya 3 months
pr/4989Fix typoGravatar Prasanta Sadhukhan 3 months
pr/5212Fixed trailing whitespaceGravatar David Holmes 3 months
pr/52368271745: Correct block size for KW,KWP mode and use fixed IV for KWP mode for...Gravatar Valerie Peng 3 months
pr/52338272856Gravatar iignatyev 3 months
pr/51548265261: Reinstate duration check and latches but with countdown 1Gravatar Brian Burkhalter 3 months
pr/5232JEP 381 cleanup: Remove unused Solaris codeGravatar Daniel Gredler 3 months
pr/52358268885: duplicate checkcast when destination type is not first type of inter...Gravatar Vicente Romero 3 months
pr/5229[PATCH] Replace usages of Collections.sort with List.sort call in public java...Gravatar Andrey Turbanov 3 months
pr/5228[PATCH] Replace usages of Collections.sort with List.sort call in IGVGravatar Andrey Turbanov 3 months
pr/52318272854Gravatar iignatyev 3 months
pr/5237voidclosureGravatar Albert Yang 3 months
pr/5168repair broken test.Gravatar Jonathan Gibbons 3 months
pr/52258272473: Parsing epoch seconds at a DST transition with a non-UTC parser is w...Gravatar Naoto Sato 3 months
pr/5195Thomas reviewGravatar Ivan Walulya 3 months
pr/5223Drop the patterns from the optionsGravatar Aleksey Shipilev 3 months
pr/5222MoveGravatar Aleksey Shipilev 3 months
pr/5186JDK-8272639: jpackaged applications using microphone on macGravatar Andy Herrick 3 months
pr/5199Adjust the commentGravatar Vladimir Ivanov 3 months
pr/5215improve pretouch_memoryGravatar Kim Barrett 3 months
pr/5015reviewGravatar Albert Yang 3 months
pr/5201more renameGravatar Albert Yang 3 months
pr/5140ci failure due to "TEST RESULT: Error. Parse Exception: [-Xbatch]: vm option(...Gravatar casparcwang 3 months
pr/52118272806: [macOS] "Apple AWT Internal Exception" when input method is changedGravatar prrace 3 months
pr/5207[PATCH] Cleanup always true condition in Metadata.TypeComparator.compareGravatar Andrey Turbanov 4 months
pr/5206JDK-8265253: javac -Xdoclint:all gives "no comment" warning for code that can...Gravatar Jonathan Gibbons 4 months
pr/52058272554: Add help message about the named pipe support of UL.Gravatar Xin Liu 4 months
pr/4019changes to make sure that ghash_long_swap_mask and counter_mask_addr calls ar...Gravatar svkamath 4 months
pr/5110Remove redundant method and testcase cleanupGravatar Seán Coffey 4 months
pr/5153fix build errorGravatar Denghui Dong 4 months
pr/52028272783: Epsilon: Refactor tests to improve performanceGravatar Aleksey Shipilev 4 months
pr/5058Fixed the right wordGravatar lawrence.andrews 4 months
pr/5116revert copyright on file that I didn't end up changing.Gravatar Coleen Phillimore 4 months
pr/52008272472: StackGuardPages test doesn't build with glibc 2.34Gravatar David Holmes 4 months
pr/5188reviewGravatar Albert Yang 4 months
pr/5085more clean upGravatar Ivan Walulya 4 months
pr/51968269687: pauth_aarch64.hpp include name is incorrectGravatar Alan Hayward 4 months
pr/5187Merge branch 'master' into JDK-8272723Gravatar Roman Kennke 4 months
pr/5107fix the printing codeGravatar Tongbao Zhang 4 months
pr/51928272736: [JVMCI] Add API for reading and writing JVMCI thread localsGravatar Tom Rodriguez 4 months
pr/5174@mlchung commentsGravatar Calvin Cheung 4 months
pr/5193v0Gravatar Zhengyu Gu 4 months
pr/5190[PATCH] Cleanup redundant assignment and condition in URIGravatar Andrey Turbanov 4 months
pr/5191copyrightGravatar iignatyev 4 months
pr/5122error in branch mergeGravatar Ivan Walulya 4 months
pr/5189Drop stream tests exclusivityGravatar Aleksey Shipilev 4 months
pr/51848258951: java/net/httpclient/HandshakeFailureTest.java failed with "RuntimeEx...Gravatar Daniel Fuchs 4 months
pr/51838272720: Fix the implementation of loop unrolling heuristic with LoopPercentP...Gravatar Jie Fu 4 months
pr/51828272708: [Test]: Cleanup: test/jdk/security/infra/java/security/cert/CertPath...Gravatar Thejasvi Voniadka 4 months
pr/5022Remove PreservedMark::init()Gravatar Roman Kennke 4 months
pr/51808272700: [macos] Build failure with Xcode 13.0 after JDK-8264848Gravatar Jie Fu 4 months
pr/5101use Unexpected node type messageGravatar Yi Yang 4 months
pr/51778272602: [macos] not all KEY_PRESSED events sent when control modifier is usedGravatar prrace 4 months
pr/51768272674: Logging missing keytab file in Krb5LoginModuleGravatar Weijun Wang 4 months
pr/5175JDK-8272667: substandard error messages from the docs buildGravatar Jonathan Gibbons 4 months
pr/51718272616: Strange code in java.text.DecimalFormat#applyPatternGravatar Andrey Turbanov 4 months
pr/51678270041: Consolidate oopDesc::cas_forward_to() and oopDesc::forward_to_atomic()Gravatar Roman Kennke 4 months
pr/5166Initial changeGravatar Aleksey Shipilev 4 months
pr/5145reviewGravatar Albert Yang 4 months
pr/5143changes proposeed by kstefanj reviewGravatar Ivan Walulya 4 months
pr/5127Fix test typo and errorGravatar Harold Seigel 4 months
pr/51638272618: Unnecessary Attr.visitIndent.noOuterThisPathGravatar Jan Lahoda 4 months
pr/51608272413: Incorrect num of element count calculation for vector castGravatar Wanghuang-Huawei 4 months
pr/5159[PATCH] Cleanup Optional usage in HttpResponse.BodySubscribers.discardingGravatar Andrey Turbanov 4 months
pr/5157[PATCH] Remove redundant zero-length check in ClassDesc.ofGravatar Andrey Turbanov 4 months
pr/5134Fixed a commentGravatar M. Seledtsov 4 months
pr/5141Check all argumentsGravatar Vladimir Ivanov 4 months
pr/5162must-recordGravatar Albert Yang 4 months
pr/5150WhitespacesGravatar Vladimir Ivanov 4 months
pr/5128restore assert in transition_from_native()Gravatar Patricio Chilano Mateo 4 months
pr/51368272369: On Linux, do not filter /run/user mounts unless an NSFE is thrownGravatar Brian Burkhalter 4 months
pr/51468223923: C2: Missing interference with mismatched unsafe accessesGravatar Vladimir Ivanov 4 months
pr/5148uint-lengthGravatar Albert Yang 4 months
pr/44138266182: Automate manual steps listed in the test jdk/sun/security/pkcs12/Par...Gravatar akolarkunnu 4 months
pr/5100small fix of tenseGravatar Julia Boes 4 months
pr/5139[IR Framework] Make AbstractInfo.getRandom() staticGravatar Christian Hagedorn 4 months
pr/5138Adjusted description, removed whitespace at end of linesGravatar Tobias Hartmann 4 months
pr/5082Restore Graphics color before leaving paintFocus()Gravatar Alexander Zuev 4 months
pr/5079VK_SHIFT test anomaly fixGravatar Prasanta Sadhukhan 4 months
pr/51378225083: Remove Google certificate that is expiring in December 2021Gravatar Rajan Halade 4 months
pr/51498270835: regression after JDK-8261006Gravatar Vicente Romero 4 months
pr/5075added -XX:+ClassUnloading in logging/ClassLoadUnloadTest.javaGravatar iignatyev 4 months
pr/51328272552Gravatar iignatyev 4 months
pr/5131copyrightGravatar iignatyev 4 months
pr/5115remove unneccessary imports.Gravatar Rajat Mahajan 4 months
pr/51308272541: Incorrect overflow test in Toom-Cook branch of BigInteger multiplica...Gravatar Brian Burkhalter 4 months
pr/5106address review commentGravatar Jonathan Gibbons 4 months
pr/5125reviewGravatar Albert Yang 4 months
pr/4983Closes JDK-8272070: simplify age calculationGravatar Hamlin-Li 4 months
pr/5126trivialGravatar Albert Yang 4 months
pr/5124Filter out SecureRandomGravatar JimLaskey 4 months
pr/5109Merge remote-tracking branch 'origin/master' into 8272446_UnsafeGet_raw_load_...Gravatar Stefan Karlsson 4 months
pr/5072Kim reviewGravatar Ivan Walulya 4 months
pr/5067Kim reviewGravatar Ivan Walulya 4 months
pr/2294Changed spec text to make correct use of tagsGravatar Evan Whelan 4 months
pr/4572Address PR commentsGravatar Maxim Kartashev 4 months
pr/5077Fixed base:top related issue and add more testsGravatar Yumin Qi 4 months
pr/51128258604: Use 'isb' instruction in SpinPause on linux-aarch64Gravatar Evgeny Astigeevich 4 months
pr/50978272297: Remove unneeded check of position and couuntGravatar Brian Burkhalter 4 months
pr/5114trivialGravatar Albert Yang 4 months
pr/5078renamed positive to shouldVMFailGravatar iignatyev 4 months
pr/49468266079: Lanai: AlphaComposite shows differences on Metal compared to OpenGLGravatar Alexey Ushakov 4 months
pr/4920packageGravatar Yi Yang 4 months
pr/5108reviewGravatar Albert Yang 4 months
pr/51118272135: jshell: Method cannot use its overloaded versionGravatar Jan Lahoda 4 months
pr/5099JDK-8264274: Simplify format specifierGravatar Hannes Wallnoefer 4 months
pr/5040feedback coleenGravatar tstuefe 4 months
pr/5005Remove vmovq vmovdGravatar Marcus G K Williams 4 months
pr/5095@iignatev comments -- sync up jdk/test/whitebox/WhiteBox.java to match the la...Gravatar iklam 4 months
pr/51058272396: mismatching debug output streamsGravatar Xuelei Fan 4 months
pr/4769Fixed exception stringGravatar lawrence.andrews 4 months
pr/5103Use toList()Gravatar Lance Andersen 4 months
pr/48318205138: Remove Applet references from Font2DTestGravatar prrace 4 months
pr/51048272391: Undeleted debug informationGravatar Xuelei Fan 4 months
pr/5102JDK-8270195: Add missing links between methods of JavaFX propertiesGravatar Jonathan Gibbons 4 months
pr/5053Removing trailing whitespace.Gravatar Jan Lahoda 4 months
pr/49248271366: Removing redundant assignment.Gravatar Jatin Bhateja 4 months
pr/4996Ioi's review comments and fix typo in test.Gravatar Coleen Phillimore 4 months
pr/5086Fix copy-paste errorGravatar Claes Redestad 4 months
pr/5056dummy commitGravatar Alexey Semenyuk 4 months
pr/5093Update compileBroker.hppGravatar Nils Eliasson 4 months
pr/50948272345Gravatar iignatyev 4 months
pr/50618140241: Use pattern matching; remove sync on position lockGravatar Brian Burkhalter 4 months
pr/5070add comment for unresolved_string_at_put()Gravatar Harold Seigel 4 months
pr/50918272332: --with-harfbuzz=system doesn't add -lharfbuzz after JDK-8255790Gravatar Severin Gehwolf 4 months
pr/50908272328: java.library.path is not set properly by Windows jpackage app launcherGravatar Alexey Semenyuk 4 months
pr/5089copyrightGravatar iignatyev 4 months
pr/5088JDK-8271159: [REDO] JDK-8249634 doclint should report implicit constructor as...Gravatar Jonathan Gibbons 4 months
pr/5087Cleanup profile counter scalingGravatar Igor Veresov 4 months
pr/50968272327: Shenandoah: Avoid enqueuing duplicate string candidatesGravatar Zhengyu Gu 4 months
pr/5083nested loop instead of sortGravatar Kim Barrett 4 months
pr/5084Improve performance of HeapDumpAllTestGravatar Ralf Schmelter 4 months
pr/5055Remove all other new [] operators in RsourceObj and the delete [] operator as...Gravatar Leo Korinth 4 months
pr/50818272310: AArch64: Add missing changes for shared vector helper methods in m4 ...Gravatar Xiaohong Gong 4 months
pr/5030add commentsGravatar Ivan Walulya 4 months
pr/5080JDK-8272158: SoftReference related bugs under memory pressureGravatar Hannes Wallnoefer 4 months
pr/50688267844: Add benchmarks for Integer/Long.decode()Gravatar Sergey Tsypanov 4 months
pr/5073reviewGravatar Albert Yang 4 months
pr/5057Merge branch 'master' into JDK-8272165Gravatar Roman Kennke 4 months
pr/5036clientSvcTicket* variables/parameters renamed to userSvcTicket* for clarity.Gravatar mbalao 4 months
pr/5069Albert suggestionGravatar Ivan Walulya 4 months
pr/50718271490: [ppc] [s390]: Crash in JavaThread::pd_get_top_frame_for_profilingGravatar Lutz Schmidt 4 months
pr/5046replace release() to a single place in insert()Gravatar Xiaowei Lu 4 months
pr/5029Review comments from StefanKGravatar Per Liden 4 months
pr/5054Fix typo and commentGravatar Hui Shi 4 months
pr/5066Preserved marks stacks must be allocated on C heap.Gravatar Thomas Schatzl 4 months
pr/4932Cleanup & simplify test by using anyMatchGravatar Christian Hagedorn 4 months
pr/5065reviewGravatar Albert Yang 4 months
pr/4930Update testGravatar Prasanta Sadhukhan 4 months
pr/5052Private implies finalGravatar Per Liden 4 months
pr/5064pgcGravatar Albert Yang 4 months
pr/4518Update test Copyright headersGravatar MBaesken 4 months
pr/5062removed empty line in ClassResolutionTestGravatar iignatyev 4 months
pr/5060Merge branch 'master' of github.com:openjdk/jdk into 8272050Gravatar Dean Long 4 months
pr/50598272169Gravatar iignatyev 4 months
pr/50448272123: Problem list 4 jtreg tests which regularly fail on macos-aarch64Gravatar prrace 4 months
pr/50508272137: no CRGravatar CC007 4 months
pr/50518272146: Disable Fibonacci test on memory constrained systemsGravatar Christoph Göttschkes 4 months
pr/50488270098: ZGC: ZBarrierSetC2::clone_at_expansion fails with "Guard against sur...Gravatar Tobias Hartmann 4 months
pr/5016remove vmthread assertGravatar Albert Yang 4 months
pr/50458271956: AArch64: C1 build failed after JDK-8270947Gravatar Hao Sun 4 months
pr/5014Changed SubXNode to SubLNodeGravatar Tobias Hartmann 4 months
pr/5063Initial fix of JDK-8272120Gravatar mrserb 4 months
pr/5031Remove obsolete commentsGravatar Roman Kennke 4 months
pr/50438272116: Update PerfDisableSharedMem with FLAG_SET_ERGO in PerfMemory::create...Gravatar Hui Shi 4 months
pr/5042Initial fix of JDK-8271718Gravatar mrserb 4 months
pr/50418272113: Build compare script fails with differences in classlistGravatar iklam 4 months
pr/48068270553: Tests should not use (real, in-use, routable) 1.1.1.1 as dummy IP valueGravatar Jonathan Dowland 4 months
pr/50358270331:Error: Not a test or directory containing tests: java/awt/print/Print...Gravatar lawrence.andrews 4 months
pr/50258272047: Remove Transfer2GPlus from problem listGravatar Brian Burkhalter 4 months
pr/50348272099Gravatar iignatyev 4 months
pr/50338264792: The NumberFormat for locale sq_XK formats price incorrectly.Gravatar Naoto Sato 4 months
pr/5017Change loader_data_raw() to regular loader_data()Gravatar Roman Kennke 4 months
pr/4927Rename use_runtime_function -> use_runtime_callGravatar Christoph Göttschkes 4 months
pr/4926Improve error msgGravatar Jie Fu 4 months
pr/4986Fixed superfluous blankGravatar David Holmes 4 months
pr/4952Merge branch 'master' into 8265602-dump-loaded-class-list-custom-loaderGravatar iklam 4 months
pr/50288272067: Initial nroff manpage generation for JDK 18Gravatar David Holmes 4 months
pr/4853replace out-of-date commentsGravatar Hamlin-Li 4 months
pr/5026MergeGravatar Jesper Wilhelmsson 4 months
pr/49418271225: Verbiage update after 8271599Gravatar Brian Burkhalter 4 months
pr/5004JDK-8271868: Warn user when using mac-sign option with unsigned app-image.Gravatar Andy Herrick 4 months
pr/50218271208: Typo in ModuleDescriptor.read javadocGravatar jpai 4 months
pr/50208271869: AArch64: build errors with GCC11 in frame::saved_oop_resultGravatar Alan Hayward 4 months
pr/50188271928: ErroneousTree with start position -1Gravatar Jan Lahoda 4 months
pr/4718review from @jayathirthraoGravatar Yi Yang 4 months
pr/4550remove null checkGravatar Denghui Dong 4 months
pr/5009MergeGravatar Jesper Wilhelmsson 4 months
pr/50108271905Gravatar iignatyev 4 months
pr/50088271904Gravatar iignatyev 4 months
pr/5007Appease jcheck.Gravatar Joe Darcy 4 months
pr/4937make variables with static final modifier CAPS, as per coding standard.Gravatar Rajat Mahajan 4 months
pr/50068271898: disable os.release_multi_mappings_vm on macOS-X64Gravatar Daniel D. Daugherty 4 months
pr/48458268824: Remove unused jdk.accessibility APIs deprecated for removal in JDK 9Gravatar prrace 4 months
pr/50038271893Gravatar iignatyev 4 months
pr/50018271892Gravatar iignatyev 4 months
pr/50008271891Gravatar iignatyev 4 months
pr/49998271890Gravatar iignatyev 4 months
pr/4998copyrightGravatar iignatyev 4 months
pr/4997copyright yearGravatar iignatyev 4 months
pr/49958260262: Use common code in function unmap_shared() in perfMemory_posix.cppGravatar Harold Seigel 4 months
pr/49408271308: Fix static initialization order problemGravatar Brian Burkhalter 4 months
pr/5013bot-topGravatar Albert Yang 4 months
pr/4993avoid other types of SSLExceptionsGravatar Fernando Guallini 4 months
pr/49948271863: ProblemList serviceability/sa/TestJmapCore.java on linux-x64 with ZGCGravatar Yasumasa Suenaga 4 months
pr/4991open image file with O_CLOEXECGravatar tstuefe 4 months
pr/49908271121: ZGC: stack overflow (segv) when -Xlog:gc+start=debugGravatar Per Liden 4 months
pr/4971Merge branch 'master'Gravatar Richard Reingruber 4 months
pr/4988Add simple Integer.toString microbenchmarksGravatar Claes Redestad 4 months
pr/49568271589: Review comment resolution.Gravatar Jatin Bhateja 4 months
pr/4985copyright yearGravatar iignatyev 4 months
pr/4984copyright yearGravatar iignatyev 4 months
pr/4981copyright yearGravatar iignatyev 4 months
pr/4980copyright yearGravatar iignatyev 4 months
pr/4951Update IPPPrintService.javaGravatar mrserb 4 months
pr/4979copyright yearGravatar iignatyev 4 months
pr/4947add comment in os.cppGravatar Calvin Cheung 4 months
pr/49638271599: Javadoc of floorDiv() and floorMod() families is inaccurate in some ...Gravatar Raffaello Giulietti 4 months
pr/49778271744Gravatar iignatyev 4 months
pr/4978v1Gravatar Patricio Chilano Mateo 4 months
pr/4976copyright yearGravatar iignatyev 4 months
pr/49758269037Gravatar iignatyev 4 months
pr/49748271224Gravatar iignatyev 4 months
pr/4817Additional code cleanup as requested by reviewerGravatar Alex Menkov 4 months
pr/49738271616: oddPart in MutableBigInteger::mutableModInverse contains info on fin...Gravatar Weijun Wang 4 months
pr/4972sreviewer uggestiedto reemove commentGravatar Ivan Walulya 4 months
pr/4848fix a typoGravatar Xubo Zhang 4 months
pr/49708271726: JFR: should use equal() to check event fields in testsGravatar Denghui Dong 4 months
pr/4836Added regression testGravatar jayathirthrao 4 months
pr/49694819544: SwingSet2 JTable Demo throws NullPointerExceptionGravatar Prasanta Sadhukhan 4 months
pr/4968startGravatar tstuefe 4 months
pr/49678271711: Remove WorkArounds.isSyntheticGravatar Joe Darcy 4 months
pr/4965Appease jcheck.Gravatar Joe Darcy 4 months
pr/4964Revert "8271150: Remove EA from JDK 17 version string starting with Initial R...Gravatar Jesper Wilhelmsson 4 months
pr/49628271601: Math.floorMod(int, int) and Math.floorMod(long, long) differ in thei...Gravatar Raffaello Giulietti 4 months
pr/4945Remove Utils from importGravatar Yumin Qi 4 months
pr/4960Merge branch 'master' into startup_classLoader0Gravatar Claes Redestad 4 months
pr/4959Merge branch 'master' into thread_accessGravatar Claes Redestad 4 months
pr/4948Merge branch 'master' into JDK-8271513Gravatar Daniel D. Daugherty 4 months
pr/4958 JDK-8271344: Windows product version issueGravatar Andy Herrick 4 months
pr/4957Use SecurityConstants.ACCESS_PERMISSION in MethodHandlesGravatar Claes Redestad 4 months
pr/4955abort-msgGravatar Albert Yang 4 months
pr/47388270160 Revert irrelevant changesGravatar Sergey Tsypanov 4 months
pr/49548271605: Update JMH devkit to 1.32Gravatar Aleksey Shipilev 4 months
pr/49536350025: API documentation for JOptionPane using deprecated methods.Gravatar Prasanta Sadhukhan 4 months
pr/44121. Fixed problems with vertical navigation in table cells;Gravatar Artem Semenov 4 months
pr/4263Draft: Eliminated duplicate code using lambda expressionsGravatar Markus Karg 4 months
pr/4874feedback zhengyuGravatar tstuefe 4 months
pr/4950MergeGravatar Jesper Wilhelmsson 4 months
pr/4671kbarrett CR - simplify 'ThreadsList::Iterator::operator!=(Iterator i)'Gravatar Daniel D. Daugherty 4 months
pr/4900Add missing space in if statementGravatar Lance Andersen 4 months
pr/4919Guard ciEnv::current() check with a test to ensure this is a compiler thread.Gravatar theRealAph 4 months
pr/4938Make unlink non-const because it's not.Gravatar Coleen Phillimore 4 months
pr/4942added const_iterate()Gravatar iklam 4 months
pr/4943Prevent NPEGravatar Prasanta Sadhukhan 4 months
pr/4936dholmes CRGravatar Daniel D. Daugherty 4 months
pr/4935Delete entry, don't just comment it out.Gravatar Chris Plummer 4 months
pr/48138270848: Review comments resolution.Gravatar Jatin Bhateja 4 months
pr/4934Remove NPE check in Validator.getInstance. Update ConstructorTest not to test...Gravatar Sean Mullan 4 months
pr/49318268963: Some default regexes matching on PrintOptoAssembly in IRNode.java do...Gravatar Christian Hagedorn 4 months
pr/4933JDK-8270060: (jdeprscan) tools/jdeprscan/tests/jdk/jdeprscan/TestRelease.java...Gravatar Jan Lahoda 4 months
pr/4928initial commitGravatar Julia Boes 4 months
pr/4925MergeGravatar Jesper Wilhelmsson 4 months
pr/4913Print 0 instead of -1 when _sampled or _constants is not avaiable.Gravatar Xin Liu 4 months
pr/23858271396: Fix spelling errorsGravatar Emmanuel Bourg 4 months
pr/24128261088: Repeatable annotations without @Target cannot have containers that t...Gravatar Liam Miller-Cushon 4 months
pr/49238268744: Improve sinking algorithm in partial peeling to avoid redundant clonesGravatar Christian Hagedorn 4 months
pr/4912Merge branch 'master' into 8270061-reorder-resource-hash-paramsGravatar iklam 4 months
pr/49218269934: RunThese24H.java failed with EXCEPTION_ACCESS_VIOLATION in java_lang...Gravatar David Holmes 4 months
pr/4911reviewGravatar rwestrel 4 months
pr/4918FixGravatar Prasanta Sadhukhan 4 months
pr/4917typoGravatar Yi Yang 4 months
pr/4916whitespaceGravatar Yi Yang 4 months
pr/49158271368: [BACKOUT] JDK-8266054 VectorAPI rotate operation optimizationGravatar Vladimir Kozlov 4 months
pr/4914MergeGravatar Jesper Wilhelmsson 4 months
pr/4922add 06_A5HGravatar Kim Barrett 4 months
pr/4767Use __SOFTFP__ instead of __ABI_HARD__, shrink ifdef blocks.Gravatar Christoph Göttschkes 4 months
pr/49108271323: [TESTBUG] serviceability/sa/ClhsdbCDSCore.java fails with -XX:Tiered...Gravatar Nick Gasson 4 months
pr/4908fix github build errorGravatar Dean Long 4 months
pr/4901Fixed array initializationGravatar David Holmes 4 months
pr/4865review from kvnGravatar Yi Yang 4 months
pr/4909startGravatar tstuefe 4 months
pr/4150More codereview commentsGravatar Bradford Wetmore 4 months
pr/4906Tweaking some spacing. Fixing some report placement.Gravatar Ian Graves 4 months
pr/4835feedback coleenGravatar tstuefe 4 months
pr/4905eliminate races in periodic gc requestsGravatar Kim Barrett 4 months
pr/4891Refactor X509CertImpl.getFingerprint(String, Debug).Gravatar Sean Mullan 4 months
pr/4860new fix with worklist checkGravatar Christian Hagedorn 4 months
pr/3627Merge branch 'master' into class-concatGravatar Sergey Tsypanov 4 months
pr/4304Merge branch 'master' into 8263561Gravatar Sergey Tsypanov 4 months
pr/4309Merge branch 'master' into 8268113Gravatar Sergey Tsypanov 4 months
pr/4902remove usenewcodeGravatar Yi Yang 4 months
pr/4903intial fixGravatar trebari 4 months
pr/48728271140: Fix native frame handling in vframeStream::asJavaVFrame()Gravatar Andreas Woess 4 months
pr/4899use STS-joiner to prevent GC safepoint concurrencyGravatar Kim Barrett 4 months
pr/4898startGravatar tstuefe 4 months
pr/4897added commentGravatar Dean Long 4 months
pr/4896MergeGravatar Jesper Wilhelmsson 4 months
pr/4895Method may not be mature is the test is run with -XX:TieredStopAtLevel=2Gravatar Igor Veresov 4 months
pr/48948271219: [REDO] JDK-8271063 Print injected fields for InstanceKlassGravatar Coleen Phillimore 4 months
pr/48938270321: Startup regressions in 18-b5 caused by JDK-8266310Gravatar Sergey Chernyshev 4 months
pr/4783Add new line in end of CipherSuiteBenchGravatar Clive Verghese 4 months
pr/48928171382: java.time.Duration missing isPositive methodGravatar Naoto Sato 4 months
pr/4607Merge latest from master branchGravatar jpai 4 months
pr/4873Deal with other package handler toolsGravatar MBaesken 4 months
pr/4889Initial commitGravatar pavelrappo 4 months
pr/48868263840: PeriodicTask should declare its destructor virtualGravatar David Holmes 4 months
pr/4882@tstuefe feedbackGravatar David Holmes 4 months
pr/48848271147: java/nio/file/Path.java javadoc typoGravatar jpai 4 months
pr/4883MergeGravatar Jesper Wilhelmsson 4 months
pr/47708075806: Add divideExact() to list of tested methodsGravatar Brian Burkhalter 5 months
pr/4880Revert "8249634: doclint should report implicit constructor as missing javado...Gravatar Daniel D. Daugherty 5 months
pr/48798268261: C2: assert(n != __null) failed: Bad immediate dominator info.Gravatar Vladimir Kozlov 5 months
pr/48788243543: jtreg test security/infra/java/security/cert/CertPathValidator/certi...Gravatar Rajan Halade 5 months
pr/48778270280: security/infra/java/security/cert/CertPathValidator/certification/Le...Gravatar Rajan Halade 5 months
pr/48768271148: static-libs-image target --with-native-debug-symbols=external doesn'...Gravatar Severin Gehwolf 5 months
pr/4875JDK-8271149Gravatar MBaesken 5 months
pr/4857kbarrett reviewGravatar Thomas Schatzl 5 months
pr/4858Pair is much nicer.Gravatar Coleen Phillimore 5 months
pr/4869ProblemList runtime/InvocationTests/invokevirtualTests.javaGravatar jamsheed_c_m 5 months
pr/4867ayang reviewGravatar Thomas Schatzl 5 months
pr/4811Address feedback and moreGravatar pavelrappo 5 months
pr/4866[IR Framework] Add missing compilation level restriction when using FlipC1C2 ...Gravatar Christian Hagedorn 5 months
pr/4864Also increased iterations in HeapMonitorStatIntervalTest.javaGravatar lmesnik 5 months
pr/4844fixed after Kim's comments.Gravatar lmesnik 5 months
pr/4761fixed typoGravatar lmesnik 5 months
pr/4618Rewording repetitive phraseGravatar Ian Graves 5 months
pr/4863MergeGravatar Jesper Wilhelmsson 5 months
pr/4862method removedGravatar lmesnik 5 months
pr/4855@calvinccheung reviewGravatar iklam 5 months
pr/4868improve assertGravatar Kim Barrett 5 months
pr/4859RenameGravatar Thomas Schatzl 5 months
pr/4789address PR commentsGravatar Julia Boes 5 months
pr/4856Remove superfluous newline, fix indentation in testGravatar Thomas Schatzl 5 months
pr/48548271015: Split cds/SharedBaseAddress.java test into smaller partsGravatar iklam 5 months
pr/4823Fix instructionGravatar Prasanta Sadhukhan 5 months
pr/48518225082: Remove IdenTrust certificate that is expiring in September 2021Gravatar Rajan Halade 5 months
pr/48478263059: update ProblemList.txtGravatar Rajan Halade 5 months
pr/48498248899: update ProblemList.txtGravatar Rajan Halade 5 months
pr/4842Revert "Added class ZeroFrame;"Gravatar Jesper Wilhelmsson 5 months
pr/4834@yminqi and @calvinccheung commentsGravatar iklam 5 months
pr/48468270993: Missing forward declaration of ZeroFrameGravatar iklam 5 months
pr/4828address Dan's commentsGravatar Patricio Chilano Mateo 5 months
pr/4843cp fixedGravatar lmesnik 5 months
pr/4840JDK-8270949: Make dynamically generated classes with the class file version o...Gravatar Mandy Chung 5 months
pr/4809fix commentsGravatar Wanghuang-Huawei 5 months
pr/4824FixGravatar Prasanta Sadhukhan 5 months
pr/4852Simplify region index comparisonGravatar Hamlin-Li 5 months
pr/48338269984: [macos] JTabbedPane title looks like disabledGravatar Alexander Zuev 5 months
pr/3334enable serialize in WindowsGravatar Xubo Zhang 5 months
pr/4832MergeGravatar Jesper Wilhelmsson 5 months
pr/4830initialGravatar Aleksandr Zvegintsev 5 months
pr/4792Making location variables volatile and moving frame coordinates requestGravatar Alexander Zuev 5 months
pr/48298270894: Use acquire semantics in ObjectSynchronizer::read_stable_mark()Gravatar Roman Kennke 5 months
pr/4815add back AccessController.doPrivilegedGravatar Weijun Wang 5 months
pr/4762fix whitespace error in previous commitGravatar Corey Ashford 5 months
pr/4803remove UnlinkedTest since it is being covered by CustomLoaderApp.javaGravatar Calvin Cheung 5 months
pr/37208266054: Re-designing benchmark to remove noise.Gravatar Jatin Bhateja 5 months
pr/48278270911: Don't use Access API to access object header wordGravatar Roman Kennke 5 months
pr/48378270908: TestParallelRefProc fails on single core machinesGravatar Christoph Göttschkes 5 months
pr/48258267585: Thread::set_thread_state generally needs release semanticsGravatar David Holmes 5 months
pr/47218253178: Trim the size for list with headersGravatar Sergei Ustimenko 5 months
pr/4436Remove FrameParser and the required allocationGravatar Ludovic Henry 5 months
pr/48228270519: Move several vector helper methods to shared header fileGravatar Xiaohong Gong 5 months
pr/48218270875: Deprecate the FilterSpuriousWakeups flag so it can be removedGravatar David Holmes 5 months
pr/48208269689: Update --release 17 symbol information for JDK 17 build 31Gravatar Joe Darcy 5 months
pr/4819fix raceGravatar Kim Barrett 5 months
pr/4784MergeGravatar tstuefe 5 months
pr/4818Fix 32-bitGravatar David Holmes 5 months
pr/4816MergeGravatar Jesper Wilhelmsson 5 months
pr/4810Including --enable-native-access in helpGravatar Jan Lahoda 5 months
pr/48148269636: Change outputStream's print_raw() and print_raw_cr() second paramete...Gravatar Calvin Cheung 5 months
pr/48128270837: fix typos in test TestSigParse.javaGravatar Harold Seigel 5 months
pr/4717rename variablesGravatar Lin Zang 5 months
pr/48088270830: Aarch64: Use stp to initialize object on C1Gravatar Wanghuang-Huawei 5 months
pr/48078261236: C2: ClhsdbJstackXcompStress test fails when StressGCM is enabledGravatar Nick Gasson 5 months
pr/4805JDK-8270820Gravatar MBaesken 5 months
pr/4802MergeGravatar Jesper Wilhelmsson 5 months
pr/4780Add commentGravatar Jie Fu 5 months
pr/48008270797: ShortECDSA.java test is not completeGravatar Weijun Wang 5 months
pr/48018270801: Print VM arguments with java -Xlog:argumentsGravatar Ioi Lam 5 months
pr/47998270794: Avoid loading Klass* twice in TypeArrayKlass::oop_size()Gravatar Roman Kennke 5 months
pr/47988269806: Emoji rendering on LinuxGravatar Nikita Gubarkov 5 months
pr/47978270554: Shenandoah: Optimize heap scan loopGravatar Roman Kennke 5 months
pr/4796crashGravatar Yi Yang 5 months
pr/47938270547: java.util.Random contains unnecessary @SuppressWarnings("exports")Gravatar Jan Lahoda 5 months
pr/4794change to assertsGravatar Ivan Walulya 5 months
pr/47908270533: AArch64: size_fits_all_mem_uses should return false if its output is...Gravatar theRealAph 5 months
pr/4699Merge firstrue 8B/LT8B codes into a macro processorGravatar Xiaohong Gong 5 months
pr/4768kbarrett reviewGravatar Thomas Schatzl 5 months
pr/4787removed redundant whitespacesGravatar aoqi 5 months
pr/47888268773: Improvements related to: Failed to start thread - pthread_create fai...Gravatar David Holmes 5 months
pr/4376Merge branch 'master' into JDK-8261006Gravatar Vicente Romero 5 months
pr/4765Complete testGravatar Zhengyu Gu 5 months
pr/4786MergeGravatar Jesper Wilhelmsson 5 months
pr/4785JDK-8265888: StandardJavaFileManager::setLocationForModule specification miss...Gravatar Jonathan Gibbons 5 months
pr/4730JDK-8269387: jpackage --add-launcher should have option to not create shortcu...Gravatar Andy Herrick 5 months
pr/47588211002: Change so that Tests.testUlpDiff() handles the NaNs and accepts a ul...Gravatar Brian Burkhalter 5 months
pr/4772@yminqi commentsGravatar iklam 5 months
pr/4782Remove G1STWDrainQueueClosureGravatar Thomas Schatzl 5 months
pr/4781JDK-8270468: TestRangeCheckEliminated fails because methods are not compiledGravatar Christoph Göttschkes 5 months
pr/4775@albertnetymk suggested changesGravatar Ivan Walulya 5 months
pr/4779remove duplicates exportsGravatar Doug Simon 5 months
pr/4778Remove unused codeGravatar Thomas Schatzl 5 months
pr/47778269637: javax/swing/JFileChooser/FileSystemView/SystemIconTest.java fails on...Gravatar Alexander Zuev 5 months
pr/47768269269: [macos11] SystemIconTest fails with ClassCastExceptionGravatar Alexander Zuev 5 months
pr/47278270100: Fix some inaccurate GC loggingGravatar Volker Simonis 5 months
pr/47748270446: Remove the MemBarNode that has been optimized from the current blockGravatar sunguoyun 5 months
pr/4510MergeGravatar tstuefe 5 months
pr/4702Add commentsGravatar bobpengxie 5 months
pr/4658Add copyright headers.Gravatar Rado Smogura 5 months
pr/4771MergeGravatar Jesper Wilhelmsson 5 months
pr/4601Fix error detection for decodeBlock.Gravatar Scott Gibbons 5 months
pr/47648269598: Regressions up to 5% on aarch64 seems due to JDK-8268858Gravatar Joshua Zhu 5 months
pr/47668269598: Regressions up to 5% on aarch64 seems due to JDK-8268858Gravatar Joshua Zhu 5 months
pr/4752rename method nameGravatar Albert Yang 5 months
pr/4755Merge branch 'JDK-8264908_bot_range_check' of https://github.com/walulyai/jdk...Gravatar Ivan Walulya 5 months
pr/47638270347: ZGC: Adopt release-acquire ordering for forwarding table accessGravatar Xiaowei Lu 5 months
pr/4750Rename internal_malloc_only to internal_amalloc, which is a better name.Gravatar Coleen Phillimore 5 months
pr/4760MergeGravatar Jesper Wilhelmsson 5 months
pr/4759JDK-8263531Gravatar Christoph Langer 5 months
pr/47116506405: More test cleanupGravatar Brian Burkhalter 5 months
pr/4754Use link suggested by Severin insteadGravatar Magnus Ihse Bursie 5 months
pr/4791refactored to javaGravatar Fernando Guallini 5 months
pr/4744Move back wait_for_root_region_scanGravatar Thomas Schatzl 5 months
pr/4697Aleksey's commentsGravatar Roman Kennke 5 months
pr/4714mistakeGravatar Yi Yang 5 months
pr/47498268894: ArrayIndexOutOfBoundsException in jdk compiler: at jdk.compiler/com....Gravatar Guoxiong Li 5 months
pr/4747fix whitespaceGravatar Jonathan Gibbons 5 months
pr/4748MergeGravatar Jesper Wilhelmsson 5 months
pr/4732Fix ARENA_ALIGN macroGravatar Coleen Phillimore 5 months
pr/4756conc-constraintGravatar Albert Yang 5 months
pr/4736Modified log message and test case for checking this messageGravatar Yumin Qi 5 months
pr/4715Merge branch 'master' of https://github.com/openjdk/jdk into 8270059-remove-k...Gravatar iklam 5 months
pr/47468270184: [TESTBUG] Add coverage for jvmci ResolvedJavaType.toJavaName() for l...Gravatar Severin Gehwolf 5 months
pr/4745Merge branch 'master' of https://git.openjdk.java.net/jdk into 8269295-verify...Gravatar Thomas Schatzl 5 months
pr/4489address review feedbackGravatar Jonathan Gibbons 5 months
pr/4742v0Gravatar Zhengyu Gu 5 months
pr/47398270155: ARM32: Improve register dump in hs_errGravatar Aleksey Shipilev 5 months
pr/4625Convert guarantee()s in asJavaVFrame() to assert()s.Gravatar Andreas Woess 5 months
pr/4741cm-rpGravatar Albert Yang 5 months
pr/47378270067: AArch64: several clhsdb tests fail with -XcompGravatar Nick Gasson 5 months
pr/4667Revert "rename"Gravatar Albert Yang 5 months
pr/4735JDK-8266565: Spec of ForwardingJavaFileManager/ForwardingFileObject/Forwardin...Gravatar Jonathan Gibbons 5 months
pr/4734MergeGravatar Jesper Wilhelmsson 5 months
pr/4740Disable compact stringGravatar Zhengyu Gu 5 months
pr/4729JDK-8270108: Update JCov version to 3.0.9Gravatar Alexander Ilin 5 months
pr/4672full.AESGCMByteBuffer dataSizeGravatar Anthony Scarpino 5 months
pr/47268270094: Shenandoah: Provide human-readable labels for test configurationsGravatar Aleksey Shipilev 5 months
pr/4725Drop the window to 1K tooGravatar Aleksey Shipilev 5 months
pr/47248270091: The path of JFR emergency dump should be able to specified by the userGravatar Yasumasa Suenaga 5 months
pr/4705ayang reviewGravatar Thomas Schatzl 5 months
pr/4723replaceGravatar Yi Yang 5 months
pr/4716Fixing bugid in ProblemList.txtGravatar Jan Lahoda 5 months
pr/47198270083: -Wnonnull errors happen with GCC 11.1.1Gravatar Yasumasa Suenaga 5 months
pr/4720rp-timerGravatar Albert Yang 5 months
pr/4670fixGravatar Denghui Dong 5 months
pr/4685refine error messageGravatar Lin Zang 5 months
pr/4507restore JSR166; restore java.desktopGravatar kelthuzadx 5 months
pr/4751move copy backGravatar Hamlin-Li 5 months
pr/4534Merge branch 'master' into JDK-8268974Gravatar Alexey Semenyuk 5 months
pr/4712Merge branch '8269418' of github.com:mgronlun/jdk into 8269418Gravatar mgronlun 5 months
pr/4520Use tryLockGravatar Alexey Bakhtin 5 months
pr/4646Save SharedPathTable array for later reclaim, remove comments for ctorsGravatar Yumin Qi 5 months
pr/47088269962: SA has unused Hashtable, Dictionary classesGravatar Coleen Phillimore 5 months
pr/4710refactored JdkInfoGravatar Fernando Guallini 5 months
pr/4707plabGravatar Albert Yang 5 months
pr/47068269993: [Test]: java/net/httpclient/DigestEchoClientSSL.java contains redund...Gravatar Thejasvi Voniadka 5 months
pr/47048215948: [TESTBUG] gtest pseudo-JavaThreads could be more regular JavaThreadsGravatar David Holmes 5 months
pr/47018268635: Corrupt oop in ClassLoaderDataGravatar Coleen Phillimore 5 months
pr/47008269851: OperatingSystemMXBean getProcessCpuLoad reports incorrect process cp...Gravatar xpbob 5 months
pr/46938269878: Review comments resolution.Gravatar Jatin Bhateja 5 months
pr/4648Update expected output now that thread name is includedGravatar David Holmes 5 months
pr/4698MergeGravatar Jesper Wilhelmsson 5 months
pr/4675missed Symbol.java part of the change.Gravatar Coleen Phillimore 5 months
pr/4696remove test from problem listGravatar Zhengyu Gu 5 months
pr/4695fix trailing whitespaceGravatar Jonathan Gibbons 5 months
pr/46928269935: ProblemList runtime/jni/checked/TestPrimitiveArrayCriticalWithBadPar...Gravatar Daniel D. Daugherty 5 months
pr/46218269481: Clean up MAX_DESC in testGravatar Brian Burkhalter 5 months
pr/4694Fix extra white space at end of line 397Gravatar Yumin Qi 5 months
pr/46918269924: Shenandoah: Introduce weak/strong marking assertsGravatar Aleksey Shipilev 5 months
pr/46908269917: Insert missing commas in copyrights in java.netGravatar Patrick Concannon 5 months
pr/4687ayang reviewGravatar Thomas Schatzl 5 months
pr/4582Adds an additional NULL check for the CP _cache.Gravatar Christoph Göttschkes 5 months
pr/4689Initial implementation of heap printing refactoringGravatar Thomas Schatzl 5 months
pr/4539Reorder messages in string to be more naturalGravatar Thomas Schatzl 5 months
pr/4574Merge remote-tracking branch 'origin/master' into JDK-8253119Gravatar Patrick Concannon 5 months
pr/4664reviewGravatar Albert Yang 5 months
pr/46868267625: AARCH64: typo in LIR_Assembler::emit_profile_typeGravatar Nick Gasson 5 months
pr/4684MergeGravatar Jesper Wilhelmsson 5 months
pr/46838269882: stack-use-after-scope in NewObjectAGravatar David Holmes 5 months
pr/4656Make idea.sh work on WSL with a Linux boot JDKGravatar Jorn Vernee 5 months
pr/45268267840: Improve URLStreamHandler.parseURL() - remove unnecessary String.conc...Gravatar Sergey Tsypanov 5 months
pr/4681Update to msdev 14.29 for Windows/aarch64.Gravatar Magnus Ihse Bursie 5 months
pr/4665address PR commentsGravatar Julia Boes 5 months
pr/42768267982: Set the node after peephole optimization to be removedGravatar sunguoyun 5 months
pr/46338269665: Update copy-right yearGravatar Sergey Tsypanov 5 months
pr/46798269113: Javac throws when compiling switch (null)Gravatar Guoxiong Li 5 months
pr/46788269738: AssertionError when combining pattern maching and function closureGravatar Guoxiong Li 5 months
pr/4676Fixed "address in use" errorGravatar Alex Menkov 5 months
pr/4673MergeGravatar Jesper Wilhelmsson 5 months
pr/4659Fixed commentGravatar Alex Menkov 5 months
pr/4536Merge branch 'master' into 8269004-resizeable-resource-hashtableGravatar iklam 5 months
pr/46448188044: Use multiplyHigh() to leverage the intrinsicGravatar Brian Burkhalter 5 months
pr/4552Merge remote-tracking branch 'origin/master' into JDK-8269124Gravatar Patrick Concannon 5 months
pr/4669Improve a bitGravatar Thomas Schatzl 5 months
pr/46688233020: (fs) UnixFileSystemProvider should use StaticProperty.userDir()Gravatar jpai 5 months
pr/4653fix and move test to new locationGravatar Zhengyu Gu 5 months
pr/4604Merge latest from upstream master branch to bring in fixes that might help fi...Gravatar jpai 5 months
pr/4423unroll when small string sizesGravatar Wanghuang-Huawei 5 months
pr/46638269652: Factor out the common code for creating system j.l.Thread objectsGravatar David Holmes 5 months
pr/4603separate test class per gcGravatar Kim Barrett 5 months
pr/4661MergeGravatar Jesper Wilhelmsson 5 months
pr/4629Restore null check to appease static analysis.Gravatar David Holmes 5 months
pr/46608188046: java.lang.Math.mutliplyHigh does not run in constant timeGravatar Brian Burkhalter 5 months
pr/4657Change the condition on defined(_LP64) rather than enumerating archesGravatar Severin Gehwolf 5 months
pr/4624restoreGravatar Albert Yang 5 months
pr/4643ooops fixed typoGravatar Coleen Phillimore 5 months
pr/4647addressing review commentsGravatar Vicente Romero 5 months
pr/4655use CYGPATH variable instead of calling cygpath directlyGravatar Jorn Vernee 5 months
pr/4654Allow specifying conf to idea.shGravatar Jorn Vernee 5 months
pr/46528244162: Additional opportunities to use NONCOPYABLEGravatar Harold Seigel 5 months
pr/44918268764: Update copy-right yearGravatar Sergey Tsypanov 5 months
pr/46518269743: test/hotspot/jtreg/vmTestbase/vm/mlvm/meth/stress/jni/nativeAndMH/Te...Gravatar miao zheng 5 months
pr/4662remove unalignedGravatar kelthuzadx 5 months
pr/4567Merge these intrinsic instructs into a macro.Gravatar TatWai Chong 5 months
pr/4645MergeGravatar Jesper Wilhelmsson 5 months
pr/4502Remove unused modules from testGravatar Liam Miller-Cushon 5 months
pr/46348269700: source level for IntelliJ JDK project is set incorrectlyGravatar Sergei Ustimenko 5 months
pr/46418268637: Update --release 17 symbol information for JDK 17 build 28Gravatar Joe Darcy 5 months
pr/4200review feedback by VladimirK, Version02 improvedGravatar jamsheed_c_m 5 months
pr/4640v1Gravatar Zhengyu Gu 5 months
pr/4632restore assertGravatar Albert Yang 5 months
pr/46398269656: The test test/langtools/tools/javac/versions/Versions.java has dupli...Gravatar Thejasvi Voniadka 5 months
pr/3917cleanup; rename Unsafe{Get,Put}Object to Unsafe{Get,Put}Gravatar Yi Yang 5 months
pr/4635Filter out quiet commandGravatar Nils Eliasson 5 months
pr/4620use fdStream instead of fileStreamGravatar Doug Simon 5 months
pr/4449use \p{XDigit}Gravatar Yi Yang 5 months
pr/46318268298: jdk/jfr/api/consumer/log/TestVerbosity.java fails: unexpected log me...Gravatar Denghui Dong 5 months
pr/4649remove dead code in zBarrierGravatar Hamlin-Li 5 months
pr/4636remove dead code in metaspaceSharedGravatar Hamlin-Li 5 months
pr/4637optimize gc-locker in GetStringCritical for latin strGravatar Hamlin-Li 5 months
pr/4650ZGC supports obj pinningGravatar Hamlin-Li 5 months
pr/4630MergeGravatar Jesper Wilhelmsson 5 months
pr/4743Added compilation id and whether a compilation is osr or not to IdealGraphPri...Gravatar jtfuller111 5 months
pr/4602post updated.Gravatar lmesnik 5 months
pr/4638remove unnecessary gc locker at mark startGravatar Hamlin-Li 5 months
pr/4623Merge branch 'master'Gravatar Richard Reingruber 5 months
pr/2498Comment tune-upsGravatar Aleksey Shipilev 5 months
pr/4610Fix assert errorGravatar casparcwang 5 months
pr/46118269478: Shenandoah: gc/shenandoah/mxbeans tests should be more resilientGravatar Aleksey Shipilev 5 months
pr/4622startGravatar tstuefe 5 months
pr/4616use st->print_raw_cr() on all lengths of class pathGravatar Calvin Cheung 5 months
pr/4600Merge remote-tracking branch 'origin/master' into 8269417Gravatar Man Cao 5 months
pr/4619MergeGravatar Jesper Wilhelmsson 5 months
pr/4615copy all code change from jdk17Gravatar Weijun Wang 5 months
pr/45916766844: Move API note of read(byte[],int,int) to normative textGravatar Brian Burkhalter 5 months
pr/4597Merge branch 'master' into aarch64_acq_rel_casGravatar theRealAph 5 months
pr/4614v1Gravatar Patricio Chilano Mateo 5 months
pr/46138268869: java in source-file mode suggests javac-only Xlint flagsGravatar Adam Sotona 5 months
pr/4612Line too logGravatar theRealAph 5 months
pr/4608wrong return typeGravatar Denghui Dong 5 months
pr/4605set-equeueGravatar Albert Yang 5 months
pr/45988268902: Testing for threadObj != NULL is unnecessary in suspend handshakeGravatar Coleen Phillimore 5 months
pr/4554Remove dead codeGravatar theRealAph 5 months
pr/4553Merge remote-tracking branch 'origin/master' into JDK-8268967Gravatar Patrick Concannon 5 months
pr/4433Merge remote-tracking branch 'origin/master' into JDK-8268469Gravatar Patrick Concannon 5 months
pr/4528revert equals, update toString, remove @throws NPEGravatar Julia Boes 5 months
pr/4596replaceGravatar Yi Yang 5 months
pr/4595add new methodsGravatar Yi Yang 5 months
pr/4593Fixed cycle condition in ListenerThread.getConnectionGravatar Alex Menkov 5 months
pr/4592Fixed alignmentGravatar David Holmes 5 months
pr/4568Remove 'Shared' from class names and rename corresponding filesGravatar Yumin Qi 5 months
pr/45908269003: Update the java manpage for JDK 18Gravatar David Holmes 5 months
pr/45614847239: Remove cast, improve exception messages in testGravatar Brian Burkhalter 5 months
pr/4368Fixed Windows register stomping.Gravatar Scott Gibbons 5 months
pr/4580Rename flag and make some minor adjustments.Gravatar Chris Plummer 5 months
pr/4587Initial implementationGravatar Thomas Schatzl 5 months
pr/4586Fix young gc verify stagesGravatar Thomas Schatzl 5 months
pr/4588trackerGravatar Albert Yang 5 months
pr/45858269303: Remove unnecessary forward declaration of PSPromotionManager in cpCa...Gravatar Zhengyu Gu 5 months
pr/4573remove useless importGravatar Denghui Dong 5 months
pr/45848269293: ObjectMonitor thread id fields should be 64 bits.Gravatar Coleen Phillimore 5 months
pr/4549Add some more cases to TestObjectSizeGravatar Ludovic Henry 5 months
pr/4583remove invalid assertionGravatar mgronlun 5 months
pr/45818269280: (bf) Replace StringBuffer in "X-Buffer".toString()Gravatar Aleksey Shipilev 5 months
pr/45896633375: FileOutputStream_md.c should be merged into FileOutputStream.cGravatar Brian Burkhalter 5 months
pr/4579MergeGravatar Jesper Wilhelmsson 5 months
pr/4577import cleanup in SupportedGroupsExtensionGravatar Jack Hartstein 5 months
pr/4576Fix string name for promptGravatar Yumin Qi 5 months
pr/45788266407: remove jdk.internal.javac.PreviewFeature.Feature.SEALED_CLASSESGravatar Vicente Romero 5 months
pr/4522fix cast in added whitebox method after 8268368Gravatar Patricio Chilano Mateo 5 months
pr/45758269186: [REDO] Remove CodeCache::mark_for_evol_deoptimization() methodGravatar Coleen Phillimore 5 months
pr/4569Missed ShenandoahControlThreadGravatar David Holmes 5 months
pr/4432Implemented reviw comments.Gravatar Mahendra Chhipa 5 months
pr/4558Adds requires compiler2 & revert compilation level detection.Gravatar Christoph Göttschkes 5 months
pr/4474remove unnecessally comments and add eof lineGravatar Yano, Masanori 5 months
pr/45708269216: Useless initialization in com/sun/crypto/provider/PBES2Parameters.javaGravatar Aleksey Shipilev 5 months
pr/4566A small typo in comment in test/lib/sun/hotspot/WhiteBox.javaGravatar miao zheng 5 months
pr/4563Revert "8264941: Remove CodeCache::mark_for_evol_deoptimization() method"Gravatar Coleen Phillimore 5 months
pr/4562MergeGravatar Jesper Wilhelmsson 5 months
pr/3980Fix INT32_MIN and cache padding.Gravatar Coleen Phillimore 5 months
pr/4560JDK-8260540Gravatar Alex Menkov 5 months
pr/45438269074: Minor restructuringGravatar Brian Burkhalter 5 months
pr/4551Much simpler fixGravatar Aleksey Shipilev 5 months
pr/45598269138: Move typeArrayOop.inline.hpp include to vectorSupport.cppGravatar Aleksey Shipilev 5 months
pr/4564add <pid> for jfr dump fileGravatar Hamlin-Li 5 months
pr/4557Initial commit - remove sparseprt.inline.hppGravatar Thomas Schatzl 5 months
pr/4497remove senseless commentGravatar Harold Seigel 5 months
pr/4556Update copyright year.Gravatar Christoph Göttschkes 5 months
pr/4571Initial commit - rename G1AllowPreventiveGC to G1UsePreventiveGCGravatar Thomas Schatzl 5 months
pr/4548Add comment about as versionGravatar MBaesken 5 months
pr/4546Remove inline specifierGravatar Guoxiong Li 6 months
pr/4540Use the Platform class from testlib to check if tiered is supported or not.Gravatar Christoph Göttschkes 6 months
pr/4541kbarrett reviewGravatar Thomas Schatzl 6 months
pr/4505Add more details in commentsGravatar Joshua Zhu 6 months
pr/4424fix the code styleGravatar dongbohe 6 months
pr/4547Clarifying docs on Scanner.hasNextLine() regarding line separatorsGravatar Ian Graves 6 months
pr/4545MergeGravatar Jesper Wilhelmsson 6 months
pr/45428266901: Clarify the method description of Duration.toDaysPart()Gravatar Naoto Sato 6 months
pr/44908268727: Remove unused slowpath locking method in OptoRuntimeGravatar miao zheng 6 months
pr/45388269077: TestSystemGC uses @require vm.gc.G1 for large pages subtestGravatar Stefan Karlsson 6 months
pr/4537Remove the entry of output in AsyncLogWriter when delete the output.Gravatar Xin Liu 6 months
pr/4523Merge branch 'master' into JDK-8263926Gravatar Guoxiong Li 6 months
pr/4535Updated tests to allow CompiledMethodLoad/Unload event to be sent in start phaseGravatar Alex Menkov 6 months
pr/4533MergeGravatar Jesper Wilhelmsson 6 months
pr/4532IOPipe.quit should check if the pipe is connectedGravatar Alex Menkov 6 months
pr/4531Initial commitGravatar Thomas Schatzl 6 months
pr/4530Update copyright year.Gravatar Christoph Göttschkes 6 months
pr/4116iwalulya review - commentsGravatar Thomas Schatzl 6 months
pr/4527remove lineGravatar Nils Eliasson 6 months
pr/4529Initial versionGravatar Thomas Schatzl 6 months
pr/4504updateGravatar Denghui Dong 6 months
pr/4408Fix VC++ warning C4099Gravatar Xin Liu 6 months
pr/4525MergeGravatar Jesper Wilhelmsson 6 months
pr/45248268678: LetsEncryptCA.java test fails as Let’s Encrypt Authority X3 is ret...Gravatar Rajan Halade 6 months
pr/3250@apiNote added, Suggests -> RequestsGravatar Aleksandr Zvegintsev 6 months
pr/4515comments from @calvinccheung and @yminqiGravatar iklam 6 months
pr/4519atomic-discoveryGravatar Albert Yang 6 months
pr/45168268927: Windows: link error: unresolved external symbol "int __cdecl convert...Gravatar David Holmes 6 months
pr/4514MergeGravatar Jesper Wilhelmsson 6 months
pr/4517initial changeGravatar Julia Boes 6 months
pr/45128268902: Testing for threadObj != NULL is unnecessary in handshakeGravatar Coleen Phillimore 6 months
pr/4291Zooming now actually keeps the current centered point in the centerGravatar James Fuller 6 months
pr/45118259066: Obsolete -XX:+AlwaysLockClassLoaderGravatar Coleen Phillimore 6 months
pr/45098264941: Remove CodeCache::mark_for_evol_deoptimization() methodGravatar Coleen Phillimore 6 months
pr/4506Merge branch 'master' into websocketGravatar Michael-Mc-Mahon 6 months
pr/3976address review commentsGravatar Aleksei Voitylov 6 months
pr/44838266082: Test more casesGravatar Joel Borggrén-Franck 6 months
pr/4508c1 code cleanupGravatar Yi Yang 6 months
pr/4173Fix CHECK_NULL.Gravatar Coleen Phillimore 6 months
pr/45038268852: AsyncLogWriter should not overide is_Named_thread()Gravatar Xin Liu 6 months
pr/4498revert the changes for freeing the _id2klass_tableGravatar Calvin Cheung 6 months
pr/45008259338: Add expiry exception for identrustdstx3 alias to VerifyCACerts.java ...Gravatar Rajan Halade 6 months
pr/4485tweak whitespaceGravatar Kim Barrett 6 months
pr/4499Merge jdk17Gravatar Jesper Wilhelmsson 6 months
pr/44958268780: Use 'print_cr' instead of 'print' for the message 'eliminated <owner...Gravatar Denghui Dong 6 months
pr/44948268778: CDS check_excluded_classes needs DumpTimeTable_lockGravatar iklam 6 months
pr/4492Revert idea.shGravatar Maurizio Cimadamore 6 months
pr/4362set_subtree_ctrl()Gravatar Christian Hagedorn 6 months
pr/4388commentGravatar rwestrel 6 months
pr/4387reviewGravatar rwestrel 6 months
pr/4479Use AsyncLogWriter::_instance->_lock directly.Gravatar Xin Liu 6 months
pr/4359added newline at eofGravatar Nils Eliasson 6 months
pr/4487Replace usages of Collection.toArray() with Collection.toArray(T[]) to avoid ...Gravatar Andrey Turbanov 6 months
pr/45018267752: KVHashtable doesn't deallocate entriesGravatar Coleen Phillimore 6 months
pr/4486v0Gravatar Zhengyu Gu 6 months
pr/4379Merge branch 'master' into lfqueueGravatar Kim Barrett 6 months
pr/44848267579: Thread::cooked_allocated_bytes() hits assert(left >= right) failed: ...Gravatar Markus Grönlund 6 months
pr/4482[PATCH] Unnecessary Vector usage in java.baseGravatar Andrey Turbanov 6 months
pr/42068266079: Lanai: AlphaComposite shows differences on Metal compared to OpenGLGravatar Alexey Ushakov 6 months
pr/44808268362: [REDO] C2 crash when compile negative Arrays.copyOf length after loopGravatar Hui Shi 6 months
pr/1864Use meaningful name. Update copyright.Gravatar Guoxiong Li 6 months
pr/1959Merge branch 'master' into JDK-8150303Gravatar Guoxiong Li 6 months
pr/2118Use meaningful nameGravatar Guoxiong Li 6 months
pr/44778267634: Update --release 17 symbol information for JDK 17 build 26Gravatar Joe Darcy 6 months
pr/4476native lib support removed.Gravatar lmesnik 6 months
pr/4488Merge branch 'master' into JDK-8268620Gravatar serb 6 months
pr/4036Third version of the fixGravatar Anton Litvinov 6 months
pr/4473Initial versionGravatar Thomas Schatzl 6 months
pr/4471Initial commitGravatar Thomas Schatzl 6 months
pr/4416addressing review changesGravatar Vicente Romero 6 months
pr/44708257038: Remove expired flags in JDK 18Gravatar David Holmes 6 months
pr/43928268293: Moving legality logic from test-generation script to java AbstractVe...Gravatar Jatin Bhateja 6 months
pr/44688268565Gravatar iignatyev 6 months
pr/4467fix trailing whitespaceGravatar Calvin Cheung 6 months
pr/44668268525: Some new memory leak after JDK-8248268 and JDK-8255557Gravatar Weijun Wang 6 months
pr/39378268549: Typo in file name in example for -Xlint:processingGravatar Piotrek Żygieło 6 months
pr/44658268555: Update HttpClient tests that use ITestContext to jtreg 6+1Gravatar Daniel Fuchs 6 months
pr/4175Merge branch 'master' into 8267630Gravatar Joe Darcy 6 months
pr/4459JDK-8262886: Fix copyright headersGravatar Hannes Wallnoefer 6 months
pr/39408266791: Annotation property which is compiled as an array property but chang...Gravatar Rafael Winterhalter 6 months
pr/4414Reviewer feedbackGravatar Erik Gahlin 6 months
pr/44638268544Gravatar iignatyev 6 months
pr/4462update copyright yearGravatar iignatyev 6 months
pr/44618268542Gravatar iignatyev 6 months
pr/4460use path to .class file in ClhsdbDumpclassGravatar iignatyev 6 months
pr/4458update copyright yearGravatar iignatyev 6 months
pr/4312Merge remote-tracking branch 'origin/master' into JDK-8268124Gravatar Patrick Concannon 6 months
pr/4457update copyright yearGravatar iignatyev 6 months
pr/39258266766: Arrays of types that cannot be an annotation member do not yield exc...Gravatar Rafael Winterhalter 6 months
pr/4456InitialGravatar Erik Gahlin 6 months
pr/4453update copyright yearGravatar iignatyev 6 months
pr/4452check exit code of jar and GetObjectSizeOverflowAgent processesGravatar iignatyev 6 months
pr/44518267448Gravatar iignatyev 6 months
pr/4450JDK-8261873Gravatar MBaesken 6 months
pr/43788268361: Fix the infinite loop in next_lineGravatar UncleNine 6 months
pr/4447MergeGravatar Serguei Spitsyn 6 months
pr/4443remove extra reference to RFC 2040Gravatar Jack Hartstein 6 months
pr/44488268520: VirtualSpace::print_on() should be constGravatar iklam 6 months
pr/4444weak_oopsGravatar Albert Yang 6 months
pr/44428268478: JVMCI tests failing after JDK-8268052Gravatar Tom Rodriguez 6 months
pr/4440Revert "8263928: Add JAWT test files for mac"Gravatar serb 6 months
pr/44418268320: Better error recovery for broken patterns in switchGravatar Jan Lahoda 6 months
pr/4439test excludedGravatar lmesnik 6 months
pr/4234fxiesGravatar lmesnik 6 months
pr/44388268475Gravatar iignatyev 6 months
pr/4437Ensure there is a header block with RCEGravatar Igor Veresov 6 months
pr/4434Move SharedClassLoadingMark to systemDictionaryShared.hppGravatar Yumin Qi 6 months
pr/4354Added new line at end of fileGravatar Evan Whelan 6 months
pr/4425Stufe review.Gravatar Stefan Johansson 6 months
pr/44358268390: G1 concurrent gc upgrade to full gc not workingGravatar Stefan Johansson 6 months
pr/4430Remove superfluous whitespace.Gravatar Christoph Göttschkes 6 months
pr/3971Update help messageGravatar Jorn Vernee 6 months
pr/4418One less File reference.Gravatar Kevin Walls 6 months
pr/4427Update wrong copyright dateGravatar Maurizio Cimadamore 6 months
pr/4429Redirty logged cards clashed with collection set freeingGravatar Thomas Schatzl 6 months
pr/44288266035: class file for sun.misc.Contended not foundGravatar Jan Lahoda 6 months
pr/4445JFR: Rework setting and getting EventHandlerGravatar mgronlun 6 months
pr/38928266598: Exception values for AnnotationTypeMismatchException are not always ...Gravatar Rafael Winterhalter 6 months
pr/4426JDK-8268377Gravatar MBaesken 6 months
pr/4278remove useless line from testGravatar rwestrel 6 months
pr/3615more commentGravatar Yi Yang 6 months
pr/4285Merge remote-tracking branch 'origin/master' into JDK-8268056Gravatar Patrick Concannon 6 months
pr/4267Revert changes for pusing nodes in loadConLNodesTuple and add comments about ...Gravatar Kazurnori OGATA 6 months
pr/4371avoid reloading forwardeeGravatar Kim Barrett 6 months
pr/3670Merge masterGravatar Wanghuang-Huawei 6 months
pr/44228268424: JFR tests fail due to GC cause 'G1 Preventive Collection' not in the...Gravatar Jie Fu 6 months
pr/3626Changes to keep home_dtd null check.Gravatar ScientificWare 6 months
pr/4421Improve test.Gravatar Paul Sandoz 6 months
pr/43738267430: GraphicsDevice.setDisplayMode(REFRESH_RATE_UNKNOWN) throws IAE: Unab...Gravatar prrace 6 months
pr/44208268417: Add test from JDK-8268360Gravatar Vladimir Kozlov 6 months
pr/4419Problemlist jstatLineCounts*.sh tests on linux-aarch64Gravatar Chris Plummer 6 months
pr/44178264866: Remove unneeded WorkArounds.isAutomaticModuleGravatar Joe Darcy 6 months
pr/4406list deprecation of Heap functions 1.0 at end of jvmti.xmlGravatar Serguei Spitsyn 6 months
pr/4396Suggest try/catch Throwable in upcallStub javadocGravatar Jorn Vernee 6 months
pr/4415Merge branch 'master' into JDK-8264144Gravatar Alexey Semenyuk 6 months
pr/4237ProblemList vmTestbase/nsk/jvmti/SuspendThread/suspendthrd003/TestDescription...Gravatar Daniel D. Daugherty 6 months
pr/4256Update help textGravatar Henry Jen 6 months
pr/4403Clean up validation of implKind REF_invokeSpecialGravatar Dan Smith 6 months
pr/4320Added extra lineGravatar Zhengyu Gu 6 months
pr/4386Fixed resouce closing issue for lib/moduls file. Pre-existing output director...Gravatar Sundararajan Athijegannathan 6 months
pr/3996Clarify exceptions that occur if initializing the filter factory from jdk.ser...Gravatar Roger Riggs 6 months
pr/4306JDK-8267764: jpackage cannot handle window screensaver files when EXE renamed...Gravatar Andy Herrick 6 months
pr/3969Feedback ColeenGravatar tstuefe 6 months
pr/4411remove incorrect castsGravatar mgronlun 6 months
pr/4358small fixGravatar Eric Liu 6 months
pr/4410ZGC: Dynamic number of GC threadsGravatar Per Liden 6 months
pr/4409testGravatar rwestrel 6 months
pr/3973Fixed CW headerGravatar Robbin Ehn 6 months
pr/4352Change "Oracle VM" to just "VM"Gravatar Chris Plummer 6 months
pr/4356fix review comment on testGravatar aghaisas 6 months
pr/44078267908: linux: thread_native_entry can scribble on stack frameGravatar David Holmes 6 months
pr/4405JDK-8268352: Rename javadoc Messager class to JavadocLogGravatar Jonathan Gibbons 6 months
pr/4404JDK-8267187: Remove deprecated constructor for LogGravatar Jonathan Gibbons 6 months
pr/44028267556: Enhance class paths check during runtimeGravatar Calvin Cheung 6 months
pr/4327@coleenp comments; clean upGravatar iklam 6 months
pr/4399Fix type from last commitGravatar Chris Plummer 6 months
pr/44018268093: Manual Testcase: "sun/security/krb5/config/native/TestDynamicStore.j...Gravatar Weijun Wang 6 months
pr/44008268349: Provide more detail in JEP 411 warning messagesGravatar Weijun Wang 6 months
pr/4209JDK-8263468: review commentsGravatar Hannes Wallnoefer 6 months
pr/4011Merge remote-tracking branch 'upstream/master' into 8266967_objectprintGravatar Kevin Walls 6 months
pr/43988264766: ClassCastException during template compilation (Variable cannot be c...Gravatar JoeWang-Java 6 months
pr/43458232948: Test should work with different EOL encondingsGravatar Joel Borggrén-Franck 6 months
pr/4383Remove whitespace.Gravatar Jiangli Zhou 6 months
pr/4395Pt1Gravatar Jorn Vernee 6 months
pr/42798261549: Adjust memory size in MTLTexurePool.mGravatar Alexey Ushakov 6 months
pr/4394Remove unused importGravatar Roberto Castañeda Lozano 6 months
pr/43978268333: javac crashes when pattern matching switch contains default case whi...Gravatar Jan Lahoda 6 months
pr/4363read onceGravatar mgronlun 6 months
pr/4360Improving javadoc as suggested on the review.Gravatar Jan Lahoda 6 months
pr/4391Revert "8267924: Misleading G1 eager reclaim detail logging"Gravatar Thomas Schatzl 6 months
pr/4390Upstream 8268169: The system lookup can not find stdio functions such as prin...Gravatar Jorn Vernee 6 months
pr/4142JDK-8266748: Use configuration instead of writer where possibleGravatar Hannes Wallnoefer 6 months
pr/43378268178: Extract sender frame parsing to CodeBlock::FrameParserGravatar Ludovic Henry 6 months
pr/4113Changed the check for the XDecoratedPeer target being javax.swing.RootPaneCon...Gravatar Maxim Kartashev 6 months
pr/4357Move compaction cause in enum to under evacuation cause.Gravatar Stefan Johansson 6 months
pr/4305Some more refactoring, sjohanns, ayang reviewsGravatar Thomas Schatzl 6 months
pr/4223Merging master into JDK-8267833Gravatar Jan Lahoda 6 months
pr/4384Revert "8267904: C2 crash when compile negative Arrays.copyOf length after loop"Gravatar Hui Shi 6 months
pr/4382Add missing ending newline.Gravatar Joe Darcy 6 months
pr/43818268299: jvms tag produces incorrect URLGravatar Joe Darcy 6 months
pr/43808268296: ScopedMemoryAccess build error with readonly filesystemsGravatar Liam Miller-Cushon 6 months
pr/43778268292: compiler/intrinsics/VectorizedMismatchTest.java fails with release VMsGravatar Jie Fu 6 months
pr/43758268289: build failure due to missing signed flag in x86 evcmpb instructionGravatar Jatin Bhateja 6 months
pr/4372Update issue numberGravatar Yasumasa Suenaga 6 months
pr/4346Fix stray renamingGravatar Dan Smith 6 months
pr/43708268279: gc/shenandoah/compiler/TestLinkToNativeRBP.java fails after LibraryL...Gravatar Xin Liu 6 months
pr/4216use printRawLines instead of println for correct newline handline on WindowsGravatar Jonathan Gibbons 6 months
pr/4339renamed socketSupported() to init()Gravatar Michael-Mc-Mahon 6 months
pr/43698268083: Got rid of realpath usage in bin/idea.shGravatar Nikita Gubarkov 6 months
pr/4332Merge branch 'master' into JDK-8268165Gravatar Xin Liu 6 months
pr/3863Applying review feedback.Gravatar Jan Lahoda 6 months
pr/43678268272: Remove JDK-8264874 changes because Graal was removed.Gravatar Vladimir Kozlov 6 months
pr/43648268267: Remove -Djavatest.security.noSecurityManager=true from jtreg runsGravatar Weijun Wang 6 months
pr/3617Fix build after mergeGravatar Nick Gasson 6 months
pr/3407call on testApp on correct threadGravatar trebari 6 months
pr/4029Remove movs from asmGravatar Alan Hayward 6 months
pr/3979Replace check by assertionGravatar MBaesken 6 months
pr/4169Updated the test to run on Windows only and to use a character from theGravatar Maxim Kartashev 6 months
pr/4251shortcuts for small valuesGravatar Richard Startin 6 months
pr/4355Disable VerifyDependencies on TestUpcall/Downcall (when in debug mode)Gravatar Maurizio Cimadamore 6 months
pr/3508Update test and example package names, README files and fix some tests to let...Gravatar Christian Hagedorn 6 months
pr/4253rerun testsGravatar Leo Korinth 6 months
pr/43618267972: Inline cache cleaning is not monotonicGravatar Erik Österlund 6 months
pr/4072merge, and a few nitsGravatar Anthony Scarpino 6 months
pr/4322@calvinccheung commentsGravatar iklam 6 months
pr/4350Fix commentsGravatar Yasumasa Suenaga 6 months
pr/43538268222: javax/xml/jaxp/unittest/transform/Bug6216226Test.java failed, cannot...Gravatar JoeWang-Java 6 months
pr/4188mixed computations loopGravatar Yi Yang 6 months
pr/43518238213: Method resolution should stop on static errorGravatar Vicente Romero 6 months
pr/4141Update SetPositionHang.javaGravatar mrserb 6 months
pr/4238remove not needed record_for_igvnGravatar Hui Shi 6 months
pr/4349Reflow paragraphs.Gravatar Joe Darcy 6 months
pr/4326Implement review commentsGravatar Sandhya Viswanathan 6 months
pr/4331updated test.Gravatar lmesnik 6 months
pr/4296Update JPasswordField.javaGravatar mrserb 6 months
pr/43478268214: Use system zlib and disable dtrace when building linux-aarch64 at Or...Gravatar Mikael Vidstedt 6 months
pr/40168266846: Add java.time.InstantSourceGravatar Stephen Colebourne 6 months
pr/4316Address review comments on shim lib makefileGravatar Maurizio Cimadamore 6 months
pr/39998266951: Review comments resolution.Gravatar Jatin Bhateja 6 months
pr/4341Merge branch 'master' into 8268142-macos-aarch64-jdk17Gravatar Mikael Vidstedt 6 months
pr/43408267995: Add reference to JVMS class file format in Lookup::defineHiddenClassGravatar Mandy Chung 6 months
pr/3638Merge masterGravatar Sandhya Viswanathan 6 months
pr/43388268095: CDS MethodHandle tests should add -XX:-VerifyDependenciesGravatar Calvin Cheung 6 months
pr/4330Merge branch 'master' into JDK-8267465Gravatar Vicente Romero 6 months
pr/4203JDK-8267598: jpackage removes system libraries from java.library.pathGravatar Andy Herrick 6 months
pr/43428268163: Change the order of fallback full GCs in G1Gravatar Stefan Johansson 6 months
pr/4334reviewGravatar Albert Yang 6 months
pr/4335Build fixGravatar Vladimir Ivanov 6 months
pr/43338268167: MultipleLogins.java failure on macosx-aarch64Gravatar Seán Coffey 6 months
pr/4317Implemented tge review comments.Gravatar Mahendra Chhipa 6 months
pr/4257Revert back to the basic bugfix and remove AsyncLogGtest.java from ProblemList.Gravatar Xin Liu 6 months
pr/4328JDK-8268150: tier2: test/jdk/tools/jpackage/junit/junit.java needs updating f...Gravatar Jonathan Gibbons 6 months
pr/4277#ifdef SYS_get_mempolicy in numa_syscall_checkGravatar Jie Fu 6 months
pr/4290Use source of elements.Gravatar Paul Sandoz 6 months
pr/4321* Increase timeout for TestUpcall/DowncallGravatar Maurizio Cimadamore 6 months
pr/4183Fix windows flags (although complied fine)Gravatar Anton Kozlov 6 months
pr/4315Update copyright yearsGravatar Jonathan Gibbons 6 months
pr/3143Revert test change and instead disable preventive GC for evac failure cases.Gravatar Aditya Mandaleeka 6 months
pr/43188266019: StreamResult(File) writes to incorrect file path if # is part of the...Gravatar JoeWang-Java 6 months
pr/3803Check vlen in bytes for unsigned supportGravatar Paul Sandoz 6 months
pr/4295Tiny editorial tweaks.Gravatar Stuart Marks 6 months
pr/2404Add AESWrapPad alias for AES with KWP mode for better interoperability and up...Gravatar Valerie Peng 6 months
pr/4313Add a comment for the non-obvious case where ni1 == null || ni2 == nullGravatar Daniel Fuchs 6 months
pr/3399Encapsulate common code to a methodGravatar Guoxiong Li 6 months
pr/4134Editorial improvements in outputWriter and inputReader.Gravatar Roger Riggs 6 months
pr/4126Remove invalid assertsGravatar Erik Gahlin 6 months
pr/43108268118: Rename bytes_os_cpu.inline.hpp files to bytes_os_cpu.hppGravatar Stefan Karlsson 6 months
pr/43118268119: Rename copy_os_cpu.inline.hpp files to copy_os_cpu.hppGravatar Stefan Karlsson 6 months
pr/43078264305: Create implementation for native accessibility peer for Statusbar ja...Gravatar Pankaj Bansal 6 months
pr/4308replace thread.sleep with countdownlatchGravatar Fernando Guallini 6 months
pr/43368265444: Javadocs: jdk.jshell - small typoGravatar Jan Lahoda 6 months
pr/4303Add newlineGravatar Maurizio Cimadamore 6 months
pr/4243Merge remote-tracking branch 'origin/master' into 8267914_events_vmoperationsGravatar Stefan Karlsson 6 months
pr/4225Thomas review.Gravatar Stefan Johansson 6 months
pr/43028268094: Some vmTestbase/nsk tests fail after ACC_STRICT/strictfp changesGravatar David Holmes 6 months
pr/43018226362: langtools ProblemList file contains more than 1 entry for a testGravatar Joel Borggrén-Franck 6 months
pr/43008268103: JNI functions incorrectly return a double after JDK-8265836Gravatar Severin Gehwolf 6 months
pr/4240castGravatar Albert Yang 6 months
pr/42998268098: jdk.CPULoad event reports incorrect CPU usage inside a containerGravatar Yasumasa Suenaga 6 months
pr/4298Update the copyrightGravatar Kochi Sakata 6 months
pr/4297Should the logging output in the test log so we can check its contents even w...Gravatar David Holmes 6 months
pr/4272Merge branch 'jdk:master' into JDK-8267969Gravatar Xiaohong Gong 6 months
pr/4292strdup_check_oom is used instead of strdup.Gravatar lmesnik 6 months
pr/4266Merge branch 'master' into 8267118-oomeGravatar David Holmes 6 months
pr/42948267861: Update SourceVersion with new language features in 16 and 17Gravatar Joe Darcy 6 months
pr/3991Merge branch 'master' into jep-306Gravatar David Holmes 6 months
pr/4258Put Number in @code tag. Thanks Naoto.Gravatar JoeWang-Java 6 months
pr/3831Fix copyright typo.Gravatar Joe Darcy 6 months
pr/3891Merge branch 'master' into 8266530Gravatar Joe Darcy 6 months
pr/42898268077: java.util.List missing from Collections Framework Overview