aboutsummaryrefslogtreecommitdiffhomepage
BranchCommit messageAuthorAge
masterMergeGravatar Jesper Wilhelmsson 4 hours
pr/4925MergeGravatar Jesper Wilhelmsson 5 hours
pr/4913Print 0 instead of -1 when _sampled or _constants is not avaiable.Gravatar Xin Liu 11 hours
pr/23858271396: Fix spelling errorsGravatar Emmanuel Bourg 12 hours
pr/4919D'oh! Stupid fencepost error.Gravatar Andrew Haley 13 hours
pr/24128261088: Repeatable annotations without @Target cannot have containers that t...Gravatar Liam Miller-Cushon 13 hours
pr/49238268744: Improve sinking algorithm in partial peeling to avoid redundant clonesGravatar Christian Hagedorn 13 hours
pr/4912Merge branch 'master' into 8270061-reorder-resource-hash-paramsGravatar iklam 13 hours
pr/4795Change AnnotatedText<T> to StyledTextGravatar pavelrappo 15 hours
pr/49218269934: RunThese24H.java failed with EXCEPTION_ACCESS_VIOLATION in java_lang...Gravatar David Holmes 19 hours
pr/4920tryGravatar Yi Yang 19 hours
pr/4911reviewGravatar rwestrel 20 hours
pr/4918FixGravatar Prasanta Sadhukhan 22 hours
pr/4917typoGravatar Yi Yang 22 hours
pr/4916whitespaceGravatar Yi Yang 22 hours
pr/49158271368: [BACKOUT] JDK-8266054 VectorAPI rotate operation optimizationGravatar Vladimir Kozlov 23 hours
pr/49248271366: [REDO] JDK-8266054 VectorAPI rotate operation optimizationGravatar Jatin Bhateja 25 hours
pr/4914MergeGravatar Jesper Wilhelmsson 29 hours
pr/4922add 06_A5HGravatar Kim Barrett 30 hours
pr/4731remove build directiveGravatar mgronlun 38 hours
pr/3880reviewGravatar rwestrel 38 hours
pr/4767Use __SOFTFP__ instead of __ABI_HARD__, shrink ifdef blocks.Gravatar Christoph Göttschkes 42 hours
pr/49108271323: [TESTBUG] serviceability/sa/ClhsdbCDSCore.java fails with -XX:Tiered...Gravatar Nick Gasson 44 hours
pr/4908fix github build errorGravatar Dean Long 45 hours
pr/4901Fixed array initializationGravatar David Holmes 46 hours
pr/4865review from kvnGravatar Yi Yang 46 hours
pr/4909startGravatar tstuefe 47 hours
pr/4150More codereview commentsGravatar Bradford Wetmore 47 hours
pr/4906Tweaking some spacing. Fixing some report placement.Gravatar Ian Graves 2 days
pr/4263Draft: Test for ChannelInputStream::transferToGravatar Markus Karg 2 days
pr/4835feedback coleenGravatar tstuefe 2 days
pr/4905eliminate races in periodic gc requestsGravatar Kim Barrett 2 days
pr/4891Refactor X509CertImpl.getFingerprint(String, Debug).Gravatar Sean Mullan 3 days
pr/4860new fix with worklist checkGravatar Christian Hagedorn 3 days
pr/4874NMT late init, hashmap variantGravatar tstuefe 3 days
pr/2261fix build issueGravatar Lin Zang 3 days
pr/4900Add missing Copyright header and address minor commentsGravatar Lance Andersen 3 days
pr/3627Merge branch 'master' into class-concatGravatar Sergey Tsypanov 3 days
pr/4304Merge branch 'master' into 8263561Gravatar Sergey Tsypanov 3 days
pr/4309Merge branch 'master' into 8268113Gravatar Sergey Tsypanov 3 days
pr/4738Merge branch 'master' into 8270160Gravatar Sergey Tsypanov 3 days
pr/4902remove usenewcodeGravatar Yi Yang 3 days
pr/4903intial fixGravatar trebari 3 days
pr/41228267356: AArch64: Vector API SVE codegen supportGravatar Ningsheng Jian 3 days
pr/3072change since version to 18Gravatar Lin Zang 3 days
pr/4550update man pageGravatar Denghui Dong 3 days
pr/48728271140: Fix native frame handling in vframeStream::asJavaVFrame()Gravatar Andreas Woess 4 days
pr/4899use STS-joiner to prevent GC safepoint concurrencyGravatar Kim Barrett 5 days
pr/4898startGravatar tstuefe 5 days
pr/4848add support for bsdGravatar Xubo Zhang 5 days
pr/4897added commentGravatar Dean Long 5 days
pr/4896MergeGravatar Jesper Wilhelmsson 5 days
pr/4895Method may not be mature is the test is run with -XX:TieredStopAtLevel=2Gravatar Igor Veresov 5 days
pr/48948271219: [REDO] JDK-8271063 Print injected fields for InstanceKlassGravatar Coleen Phillimore 5 days
pr/48938270321: Startup regressions in 18-b5 caused by JDK-8266310Gravatar Sergey Chernyshev 5 days
pr/4783Add new line in end of CipherSuiteBenchGravatar Clive Verghese 5 days
pr/48928171382: java.time.Duration missing isPositive methodGravatar Naoto Sato 5 days
pr/4607Merge latest from master branchGravatar jpai 6 days
pr/4873Deal with other package handler toolsGravatar MBaesken 6 days
pr/4889Initial commitGravatar pavelrappo 6 days
pr/4887Fixed formattingGravatar Alexey Bakhtin 6 days
pr/48868263840: PeriodicTask should declare its destructor virtualGravatar David Holmes 6 days
pr/4882@tstuefe feedbackGravatar David Holmes 6 days
pr/4885add inclusion of os.hppGravatar Yasumasa Suenaga 6 days
pr/48848271147: java/nio/file/Path.java javadoc typoGravatar jpai 6 days
pr/4883MergeGravatar Jesper Wilhelmsson 6 days
pr/47708075806: Add divideExact() to list of tested methodsGravatar Brian Burkhalter 6 days
pr/4880Revert "8249634: doclint should report implicit constructor as missing javado...Gravatar Daniel D. Daugherty 6 days
pr/48798268261: C2: assert(n != __null) failed: Bad immediate dominator info.Gravatar Vladimir Kozlov 6 days
pr/48788243543: jtreg test security/infra/java/security/cert/CertPathValidator/certi...Gravatar Rajan Halade 6 days
pr/48778270280: security/infra/java/security/cert/CertPathValidator/certification/Le...Gravatar Rajan Halade 6 days
pr/48768271148: static-libs-image target --with-native-debug-symbols=external doesn'...Gravatar Severin Gehwolf 7 days
pr/4875JDK-8271149Gravatar MBaesken 7 days
pr/4857kbarrett reviewGravatar Thomas Schatzl 7 days
pr/4858Pair is much nicer.Gravatar Coleen Phillimore 7 days
pr/4518Minor adjustments, handling of UnlimitedGravatar MBaesken 7 days
pr/4869ProblemList runtime/InvocationTests/invokevirtualTests.javaGravatar jamsheed_c_m 7 days
pr/4867ayang reviewGravatar Thomas Schatzl 7 days
pr/4811Address feedback and moreGravatar pavelrappo 7 days
pr/4866[IR Framework] Add missing compilation level restriction when using FlipC1C2 ...Gravatar Christian Hagedorn 7 days
pr/4718typoGravatar Yi Yang 7 days
pr/4864Also increased iterations in HeapMonitorStatIntervalTest.javaGravatar lmesnik 7 days
pr/4844fixed after Kim's comments.Gravatar lmesnik 7 days
pr/4761fixed typoGravatar lmesnik 7 days
pr/4618Rewording repetitive phraseGravatar Ian Graves 7 days
pr/4863MergeGravatar Jesper Wilhelmsson 7 days
pr/4862method removedGravatar lmesnik 7 days
pr/4674Updates with more test coverageGravatar Ian Graves 7 days
pr/4733Merge branch 'master' into JDK-8260265Gravatar Naoto Sato 7 days
pr/4855@calvinccheung reviewGravatar iklam 8 days
pr/48618181571: printing to CUPS fails on mac sandbox appGravatar AlexanderScherbatiy 8 days
pr/4868improve assertGravatar Kim Barrett 8 days
pr/44121. The comment states that it is not necessary to call ExceptionCheck, but it...Gravatar Artem Semenov 8 days
pr/4859RenameGravatar Thomas Schatzl 8 days
pr/4789address PR commentsGravatar Julia Boes 8 days
pr/4856Remove superfluous newline, fix indentation in testGravatar Thomas Schatzl 8 days
pr/48548271015: Split cds/SharedBaseAddress.java test into smaller partsGravatar iklam 8 days
pr/4823Fix instructionGravatar Prasanta Sadhukhan 8 days
pr/48518225082: Remove IdenTrust certificate that is expiring in September 2021Gravatar Rajan Halade 8 days
pr/48478263059: update ProblemList.txtGravatar Rajan Halade 8 days
pr/48498248899: update ProblemList.txtGravatar Rajan Halade 8 days
pr/48508270609: [TESTBUG] java/awt/print/Dialog/DialogCopies.java does not show inst...Gravatar lawrence.andrews 8 days
pr/4842Revert "Added class ZeroFrame;"Gravatar Jesper Wilhelmsson 8 days
pr/4834@yminqi and @calvinccheung commentsGravatar iklam 8 days
pr/48468270993: Missing forward declaration of ZeroFrameGravatar iklam 8 days
pr/4828address Dan's commentsGravatar Patricio Chilano Mateo 8 days
pr/4845-8268824: Remove unused jdk.accessibility APIs deprecated for removal in JDK 9Gravatar prrace 8 days
pr/4843cp fixedGravatar lmesnik 8 days
pr/4840JDK-8270949: Make dynamically generated classes with the class file version o...Gravatar Mandy Chung 9 days
pr/4809fix commentsGravatar Wanghuang-Huawei 9 days
pr/48368270893: IndexOutOfBoundsException while reading large TIFF fileGravatar jayathirthrao 9 days
pr/4824FixGravatar Prasanta Sadhukhan 9 days
pr/4853redirty remset only for young regions when handle evac failure objGravatar Hamlin-Li 9 days
pr/4852Simplify region index comparisonGravatar Hamlin-Li 9 days
pr/48338269984: [macos] JTabbedPane title looks like disabledGravatar Alexander Zuev 9 days
pr/3334enable serialize in WindowsGravatar Xubo Zhang 9 days
pr/4832MergeGravatar Jesper Wilhelmsson 9 days
pr/4830initialGravatar Aleksandr Zvegintsev 9 days
pr/48318205138: Remove Applet references from Font2DTestGravatar prrace 9 days
pr/4792Making location variables volatile and moving frame coordinates requestGravatar Alexander Zuev 9 days
pr/48298270894: Use acquire semantics in ObjectSynchronizer::read_stable_mark()Gravatar Roman Kennke 9 days
pr/4815add back AccessController.doPrivilegedGravatar Weijun Wang 9 days
pr/4762fix whitespace error in previous commitGravatar Corey Ashford 9 days
pr/4803remove UnlinkedTest since it is being covered by CustomLoaderApp.javaGravatar Calvin Cheung 9 days
pr/37208266054: Re-designing benchmark to remove noise.Gravatar Jatin Bhateja 10 days
pr/48278270911: Don't use Access API to access object header wordGravatar Roman Kennke 10 days
pr/48378270908: TestParallelRefProc fails on single core machinesGravatar Christoph Göttschkes 10 days
pr/48258267585: Thread::set_thread_state generally needs release semanticsGravatar David Holmes 10 days
pr/46428268788: Annotations with lambda expressions can still cause AnnotationFormat...Gravatar Sergei Ustimenko 10 days
pr/47218253178: Trim the size for list with headersGravatar Sergei Ustimenko 10 days
pr/4572Addressed PR commentsGravatar Maxim Kartashev 10 days
pr/4436Remove FrameParser and the required allocationGravatar Ludovic Henry 10 days
pr/48228270519: Move several vector helper methods to shared header fileGravatar Xiaohong Gong 10 days
pr/48218270875: Deprecate the FilterSpuriousWakeups flag so it can be removedGravatar David Holmes 10 days
pr/48208269689: Update --release 17 symbol information for JDK 17 build 31Gravatar Joe Darcy 10 days
pr/4819fix raceGravatar Kim Barrett 11 days
pr/4784MergeGravatar tstuefe 12 days
pr/4818Fix 32-bitGravatar David Holmes 12 days
pr/4817Fixed AttachingConnector testsGravatar Alex Menkov 12 days
pr/4816MergeGravatar Jesper Wilhelmsson 12 days
pr/4810Including --enable-native-access in helpGravatar Jan Lahoda 12 days
pr/48148269636: Change outputStream's print_raw() and print_raw_cr() second paramete...Gravatar Calvin Cheung 13 days
pr/48128270837: fix typos in test TestSigParse.javaGravatar Harold Seigel 13 days
pr/4717rename variablesGravatar Lin Zang 13 days
pr/48088270830: Aarch64: Use stp to initialize object on C1Gravatar Wanghuang-Huawei 13 days
pr/48078261236: C2: ClhsdbJstackXcompStress test fails when StressGCM is enabledGravatar Nick Gasson 13 days
pr/4805JDK-8270820Gravatar MBaesken 13 days
pr/48138270848: Redundant unsafe opmask register allocation in some instruction patt...Gravatar Jatin Bhateja 13 days
pr/4802MergeGravatar Jesper Wilhelmsson 13 days
pr/4780Add commentGravatar Jie Fu 13 days
pr/48008270797: ShortECDSA.java test is not completeGravatar Weijun Wang 13 days
pr/48018270801: Print VM arguments with java -Xlog:argumentsGravatar Ioi Lam 13 days
pr/47998270794: Avoid loading Klass* twice in TypeArrayKlass::oop_size()Gravatar Roman Kennke 13 days
pr/47988269806: Emoji rendering on LinuxGravatar Nikita Gubarkov 14 days
pr/48068270553: Tests should not use (real, in-use, routable) 1.1.1.1 as dummy IP valueGravatar Jonathan Dowland 14 days
pr/47978270554: Shenandoah: Optimize heap scan loopGravatar Roman Kennke 14 days
pr/4796crashGravatar Yi Yang 14 days
pr/47938270547: java.util.Random contains unnecessary @SuppressWarnings("exports")Gravatar Jan Lahoda 14 days
pr/4794change to assertsGravatar Ivan Walulya 14 days
pr/47908270533: AArch64: size_fits_all_mem_uses should return false if its output is...Gravatar theRealAph 14 days
pr/4699Merge firstrue 8B/LT8B codes into a macro processorGravatar Xiaohong Gong 14 days
pr/4768kbarrett reviewGravatar Thomas Schatzl 14 days
pr/4787removed redundant whitespacesGravatar aoqi 14 days
pr/47888268773: Improvements related to: Failed to start thread - pthread_create fai...Gravatar David Holmes 14 days
pr/4722fix style and add unalign test caseGravatar Wanghuang-Huawei 2 weeks
pr/4376Merge branch 'master' into JDK-8261006Gravatar Vicente Romero 2 weeks
pr/4765Complete testGravatar Zhengyu Gu 2 weeks
pr/4786MergeGravatar Jesper Wilhelmsson 2 weeks
pr/4019Updated AES-GCM intrinsic to match latest Java CodeGravatar svkamath 2 weeks
pr/4785JDK-8265888: StandardJavaFileManager::setLocationForModule specification miss...Gravatar Jonathan Gibbons 2 weeks
pr/4730JDK-8269387: jpackage --add-launcher should have option to not create shortcu...Gravatar Andy Herrick 2 weeks
pr/47588211002: Change so that Tests.testUlpDiff() handles the NaNs and accepts a ul...Gravatar Brian Burkhalter 2 weeks
pr/4772@yminqi commentsGravatar iklam 2 weeks
pr/4782Remove G1STWDrainQueueClosureGravatar Thomas Schatzl 2 weeks
pr/4781JDK-8270468: TestRangeCheckEliminated fails because methods are not compiledGravatar Christoph Göttschkes 2 weeks
pr/4775@albertnetymk suggested changesGravatar Ivan Walulya 2 weeks
pr/4779remove duplicates exportsGravatar Doug Simon 2 weeks
pr/4778Remove unused codeGravatar Thomas Schatzl 2 weeks
pr/47778269637: javax/swing/JFileChooser/FileSystemView/SystemIconTest.java fails on...Gravatar Alexander Zuev 2 weeks
pr/47768269269: [macos11] SystemIconTest fails with ClassCastExceptionGravatar Alexander Zuev 2 weeks
pr/47278270100: Fix some inaccurate GC loggingGravatar Volker Simonis 2 weeks
pr/47748270446: Remove the MemBarNode that has been optimized from the current blockGravatar sunguoyun 2 weeks
pr/4510MergeGravatar tstuefe 2 weeks
pr/4702Add commentsGravatar bobpengxie 2 weeks
pr/4658Add copyright headers.Gravatar Rado Smogura 2 weeks
pr/4771MergeGravatar Jesper Wilhelmsson 2 weeks
pr/4601Fix error detection for decodeBlock.Gravatar Scott Gibbons 2 weeks
pr/47648269598: Regressions up to 5% on aarch64 seems due to JDK-8268858Gravatar Joshua Zhu 2 weeks
pr/47668269598: Regressions up to 5% on aarch64 seems due to JDK-8268858Gravatar Joshua Zhu 2 weeks
pr/4752rename method nameGravatar Albert Yang 2 weeks
pr/4755Merge branch 'JDK-8264908_bot_range_check' of https://github.com/walulyai/jdk...Gravatar Ivan Walulya 2 weeks
pr/47638270347: ZGC: Adopt release-acquire ordering for forwarding table accessGravatar Xiaowei Lu 2 weeks
pr/4750Rename internal_malloc_only to internal_amalloc, which is a better name.Gravatar Coleen Phillimore 2 weeks
pr/4760MergeGravatar Jesper Wilhelmsson 2 weeks
pr/47698270312: Error: Not a test or directory containing tests: java/awt/print/Prin...Gravatar Lawrence.Andrews 2 weeks
pr/4759JDK-8263531Gravatar Christoph Langer 2 weeks
pr/47116506405: More test cleanupGravatar Brian Burkhalter 2 weeks
pr/4754Use link suggested by Severin insteadGravatar Magnus Ihse Bursie 2 weeks
pr/4791refactored to javaGravatar Fernando Guallini 2 weeks
pr/4744Move back wait_for_root_region_scanGravatar Thomas Schatzl 2 weeks
pr/4697Aleksey's commentsGravatar Roman Kennke 2 weeks
pr/47538270290: NTLM authentication fails if HEAD request is usedGravatar Alex Kashchenko 2 weeks
pr/4714mistakeGravatar Yi Yang 2 weeks
pr/47498268894: ArrayIndexOutOfBoundsException in jdk compiler: at jdk.compiler/com....Gravatar Guoxiong Li 3 weeks
pr/4747fix whitespaceGravatar Jonathan Gibbons 3 weeks
pr/4748MergeGravatar Jesper Wilhelmsson 3 weeks
pr/4732Fix ARENA_ALIGN macroGravatar Coleen Phillimore 3 weeks
pr/4756conc-constraintGravatar Albert Yang 3 weeks
pr/4736Modified log message and test case for checking this messageGravatar Yumin Qi 3 weeks
pr/4715Merge branch 'master' of https://github.com/openjdk/jdk into 8270059-remove-k...Gravatar iklam 3 weeks
pr/47468270184: [TESTBUG] Add coverage for jvmci ResolvedJavaType.toJavaName() for l...Gravatar Severin Gehwolf 3 weeks
pr/4745Merge branch 'master' of https://git.openjdk.java.net/jdk into 8269295-verify...Gravatar Thomas Schatzl 3 weeks
pr/4489address review feedbackGravatar Jonathan Gibbons 3 weeks
pr/4742v0Gravatar Zhengyu Gu 3 weeks
pr/47398270155: ARM32: Improve register dump in hs_errGravatar Aleksey Shipilev 3 weeks
pr/4625Convert guarantee()s in asJavaVFrame() to assert()s.Gravatar Andreas Woess 3 weeks
pr/4741cm-rpGravatar Albert Yang 3 weeks
pr/47378270067: AArch64: several clhsdb tests fail with -XcompGravatar Nick Gasson 3 weeks
pr/4667Revert "rename"Gravatar Albert Yang 3 weeks
pr/4735JDK-8266565: Spec of ForwardingJavaFileManager/ForwardingFileObject/Forwardin...Gravatar Jonathan Gibbons 3 weeks
pr/4734MergeGravatar Jesper Wilhelmsson 3 weeks
pr/4740Disable compact stringGravatar Zhengyu Gu 3 weeks
pr/4729JDK-8270108: Update JCov version to 3.0.9Gravatar Alexander Ilin 3 weeks
pr/4728Revert debuggingGravatar Aleksey Shipilev 3 weeks
pr/4672full.AESGCMByteBuffer dataSizeGravatar Anthony Scarpino 3 weeks
pr/47268270094: Shenandoah: Provide human-readable labels for test configurationsGravatar Aleksey Shipilev 3 weeks
pr/4725Drop the window to 1K tooGravatar Aleksey Shipilev 3 weeks
pr/47248270091: The path of JFR emergency dump should be able to specified by the userGravatar Yasumasa Suenaga 3 weeks
pr/4705ayang reviewGravatar Thomas Schatzl 3 weeks
pr/4723replaceGravatar Yi Yang 3 weeks
pr/4716Fixing bugid in ProblemList.txtGravatar Jan Lahoda 3 weeks
pr/47198270083: -Wnonnull errors happen with GCC 11.1.1Gravatar Yasumasa Suenaga 3 weeks
pr/4720rp-timerGravatar Albert Yang 3 weeks
pr/4670fixGravatar Denghui Dong 3 weeks
pr/4685refine error messageGravatar Lin Zang 3 weeks
pr/4507restore JSR166; restore java.desktopGravatar kelthuzadx 3 weeks
pr/4751move copy backGravatar Hamlin-Li 3 weeks
pr/4534Merge branch 'master' into JDK-8268974Gravatar Alexey Semenyuk 3 weeks
pr/4712Merge branch '8269418' of github.com:mgronlun/jdk into 8269418Gravatar mgronlun 3 weeks
pr/4520Use tryLockGravatar Alexey Bakhtin 3 weeks
pr/4646Save SharedPathTable array for later reclaim, remove comments for ctorsGravatar Yumin Qi 3 weeks
pr/47088269962: SA has unused Hashtable, Dictionary classesGravatar Coleen Phillimore 3 weeks
pr/44728263364: outputGravatar frkator 3 weeks
pr/4710refactored JdkInfoGravatar Fernando Guallini 3 weeks
pr/4707plabGravatar Albert Yang 3 weeks
pr/47068269993: [Test]: java/net/httpclient/DigestEchoClientSSL.java contains redund...Gravatar Thejasvi Voniadka 3 weeks
pr/47048215948: [TESTBUG] gtest pseudo-JavaThreads could be more regular JavaThreadsGravatar David Holmes 3 weeks
pr/47018268635: Corrupt oop in ClassLoaderDataGravatar Coleen Phillimore 3 weeks
pr/47008269851: OperatingSystemMXBean getProcessCpuLoad reports incorrect process cp...Gravatar xpbob 3 weeks
pr/46938269878: Review comments resolution.Gravatar Jatin Bhateja 3 weeks
pr/4648Update expected output now that thread name is includedGravatar David Holmes 3 weeks
pr/4698MergeGravatar Jesper Wilhelmsson 3 weeks
pr/4675missed Symbol.java part of the change.Gravatar Coleen Phillimore 3 weeks
pr/4696remove test from problem listGravatar Zhengyu Gu 3 weeks
pr/4695fix trailing whitespaceGravatar Jonathan Gibbons 3 weeks
pr/46928269935: ProblemList runtime/jni/checked/TestPrimitiveArrayCriticalWithBadPar...Gravatar Daniel D. Daugherty 3 weeks
pr/46218269481: Clean up MAX_DESC in testGravatar Brian Burkhalter 3 weeks
pr/4694Fix extra white space at end of line 397Gravatar Yumin Qi 3 weeks
pr/46918269924: Shenandoah: Introduce weak/strong marking assertsGravatar Aleksey Shipilev 3 weeks
pr/46908269917: Insert missing commas in copyrights in java.netGravatar Patrick Concannon 3 weeks
pr/4687ayang reviewGravatar Thomas Schatzl 3 weeks
pr/4582Adds an additional NULL check for the CP _cache.Gravatar Christoph Göttschkes 3 weeks
pr/4689Initial implementation of heap printing refactoringGravatar Thomas Schatzl 3 weeks
pr/4539Reorder messages in string to be more naturalGravatar Thomas Schatzl 3 weeks
pr/4574Merge remote-tracking branch 'origin/master' into JDK-8253119Gravatar Patrick Concannon 3 weeks
pr/4664reviewGravatar Albert Yang 3 weeks
pr/46868267625: AARCH64: typo in LIR_Assembler::emit_profile_typeGravatar Nick Gasson 3 weeks
pr/4684MergeGravatar Jesper Wilhelmsson 3 weeks
pr/46838269882: stack-use-after-scope in NewObjectAGravatar David Holmes 3 weeks
pr/4656Make idea.sh work on WSL with a Linux boot JDKGravatar Jorn Vernee 3 weeks
pr/2496Add TODOGravatar Aleksey Shipilev 3 weeks
pr/45268267840: Improve URLStreamHandler.parseURL() - remove unnecessary String.conc...Gravatar Sergey Tsypanov 3 weeks
pr/4681Update to msdev 14.29 for Windows/aarch64.Gravatar Magnus Ihse Bursie 3 weeks
pr/4666fix write size issueGravatar Lin Zang 3 weeks
pr/4665address PR commentsGravatar Julia Boes 3 weeks
pr/42768267982: Set the node after peephole optimization to be removedGravatar sunguoyun 3 weeks
pr/46338269665: Update copy-right yearGravatar Sergey Tsypanov 3 weeks
pr/46798269113: Javac throws when compiling switch (null)Gravatar Guoxiong Li 3 weeks
pr/46788269738: AssertionError when combining pattern maching and function closureGravatar Guoxiong Li 4 weeks
pr/4671kbarrett CR - delete unused _list member.Gravatar Daniel D. Daugherty 4 weeks
pr/4676Fixed "address in use" errorGravatar Alex Menkov 4 weeks
pr/46778249004: Reduce ThreadListHandle overhead in relation to direct handshakesGravatar Daniel D. Daugherty 4 weeks
pr/4673MergeGravatar Jesper Wilhelmsson 4 weeks
pr/4659Fixed commentGravatar Alex Menkov 4 weeks
pr/4536Merge branch 'master' into 8269004-resizeable-resource-hashtableGravatar iklam 4 weeks
pr/46448188044: Use multiplyHigh() to leverage the intrinsicGravatar Brian Burkhalter 4 weeks
pr/4552Merge remote-tracking branch 'origin/master' into JDK-8269124Gravatar Patrick Concannon 4 weeks
pr/4669Improve a bitGravatar Thomas Schatzl 4 weeks
pr/46688233020: (fs) UnixFileSystemProvider should use StaticProperty.userDir()Gravatar jpai 4 weeks
pr/4653fix and move test to new locationGravatar Zhengyu Gu 4 weeks
pr/4604Merge latest from upstream master branch to bring in fixes that might help fi...Gravatar jpai 4 weeks
pr/4423unroll when small string sizesGravatar Wanghuang-Huawei 4 weeks
pr/46638269652: Factor out the common code for creating system j.l.Thread objectsGravatar David Holmes 4 weeks
pr/4603separate test class per gcGravatar Kim Barrett 4 weeks
pr/4661MergeGravatar Jesper Wilhelmsson 4 weeks
pr/4629Restore null check to appease static analysis.Gravatar David Holmes 4 weeks
pr/46608188046: java.lang.Math.mutliplyHigh does not run in constant timeGravatar Brian Burkhalter 4 weeks
pr/4657Change the condition on defined(_LP64) rather than enumerating archesGravatar Severin Gehwolf 4 weeks
pr/4624restoreGravatar Albert Yang 4 weeks
pr/4643ooops fixed typoGravatar Coleen Phillimore 4 weeks
pr/4647addressing review commentsGravatar Vicente Romero 4 weeks
pr/4655use CYGPATH variable instead of calling cygpath directlyGravatar Jorn Vernee 4 weeks
pr/4654Allow specifying conf to idea.shGravatar Jorn Vernee 4 weeks
pr/46528244162: Additional opportunities to use NONCOPYABLEGravatar Harold Seigel 4 weeks
pr/44918268764: Update copy-right yearGravatar Sergey Tsypanov 4 weeks
pr/46518269743: test/hotspot/jtreg/vmTestbase/vm/mlvm/meth/stress/jni/nativeAndMH/Te...Gravatar miao zheng 4 weeks
pr/4662remove unalignedGravatar kelthuzadx 4 weeks
pr/4567Merge these intrinsic instructs into a macro.Gravatar TatWai Chong 4 weeks
pr/4645MergeGravatar Jesper Wilhelmsson 4 weeks
pr/4502Remove unused modules from testGravatar Liam Miller-Cushon 4 weeks
pr/46348269700: source level for IntelliJ JDK project is set incorrectlyGravatar Sergei Ustimenko 4 weeks
pr/46418268637: Update --release 17 symbol information for JDK 17 build 28Gravatar Joe Darcy 4 weeks
pr/4200review feedback by VladimirK, Version02 improvedGravatar jamsheed_c_m 4 weeks
pr/4640v1Gravatar Zhengyu Gu 4 weeks
pr/4632restore assertGravatar Albert Yang 4 weeks
pr/46398269656: The test test/langtools/tools/javac/versions/Versions.java has dupli...Gravatar Thejasvi Voniadka 4 weeks
pr/3917cleanup; rename Unsafe{Get,Put}Object to Unsafe{Get,Put}Gravatar Yi Yang 4 weeks
pr/4635Filter out quiet commandGravatar Nils Eliasson 4 weeks
pr/4620use fdStream instead of fileStreamGravatar Doug Simon 4 weeks
pr/4449use \p{XDigit}Gravatar Yi Yang 4 weeks
pr/46318268298: jdk/jfr/api/consumer/log/TestVerbosity.java fails: unexpected log me...Gravatar Denghui Dong 4 weeks
pr/4649remove dead code in zBarrierGravatar Hamlin-Li 4 weeks
pr/4636remove dead code in metaspaceSharedGravatar Hamlin-Li 4 weeks
pr/4637optimize gc-locker in GetStringCritical for latin strGravatar Hamlin-Li 4 weeks
pr/4650ZGC supports obj pinningGravatar Hamlin-Li 4 weeks
pr/4630MergeGravatar Jesper Wilhelmsson 4 weeks
pr/4743Added compilation id and whether a compilation is osr or not to IdealGraphPri...Gravatar jtfuller111 4 weeks
pr/4602post updated.Gravatar lmesnik 4 weeks
pr/4638remove unnecessary gc locker at mark startGravatar Hamlin-Li 4 weeks
pr/4623Merge branch 'master'Gravatar Richard Reingruber 4 weeks
pr/2498Comment tune-upsGravatar Aleksey Shipilev 4 weeks
pr/4610Fix assert errorGravatar casparcwang 4 weeks
pr/46118269478: Shenandoah: gc/shenandoah/mxbeans tests should be more resilientGravatar Aleksey Shipilev 4 weeks
pr/4622startGravatar tstuefe 4 weeks
pr/4616use st->print_raw_cr() on all lengths of class pathGravatar Calvin Cheung 4 weeks
pr/4600Merge remote-tracking branch 'origin/master' into 8269417Gravatar Man Cao 4 weeks
pr/4619MergeGravatar Jesper Wilhelmsson 4 weeks
pr/4615copy all code change from jdk17Gravatar Weijun Wang 4 weeks
pr/45916766844: Move API note of read(byte[],int,int) to normative textGravatar Brian Burkhalter 4 weeks
pr/4597Merge branch 'master' into aarch64_acq_rel_casGravatar theRealAph 4 weeks
pr/4614v1Gravatar Patricio Chilano Mateo 4 weeks
pr/46138268869: java in source-file mode suggests javac-only Xlint flagsGravatar Adam Sotona 4 weeks
pr/4612Line too logGravatar theRealAph 4 weeks
pr/4608wrong return typeGravatar Denghui Dong 4 weeks
pr/4605set-equeueGravatar Albert Yang 5 weeks
pr/45988268902: Testing for threadObj != NULL is unnecessary in suspend handshakeGravatar Coleen Phillimore 5 weeks
pr/4554Remove dead codeGravatar theRealAph 5 weeks
pr/4553Merge remote-tracking branch 'origin/master' into JDK-8268967Gravatar Patrick Concannon 5 weeks
pr/4433Merge remote-tracking branch 'origin/master' into JDK-8268469Gravatar Patrick Concannon 5 weeks
pr/4528revert equals, update toString, remove @throws NPEGravatar Julia Boes 5 weeks
pr/4596replaceGravatar Yi Yang 5 weeks
pr/4595add new methodsGravatar Yi Yang 5 weeks
pr/45948269373: some tests in jdk/tools/launcher/ fails on localized Windows platformGravatar Yano, Masanori 5 weeks
pr/4593Fixed cycle condition in ListenerThread.getConnectionGravatar Alex Menkov 5 weeks
pr/4592Fixed alignmentGravatar David Holmes 5 weeks
pr/4568Remove 'Shared' from class names and rename corresponding filesGravatar Yumin Qi 5 weeks
pr/45908269003: Update the java manpage for JDK 18Gravatar David Holmes 5 weeks
pr/45614847239: Remove cast, improve exception messages in testGravatar Brian Burkhalter 5 weeks
pr/4368Fixed Windows register stomping.Gravatar Scott Gibbons 5 weeks
pr/4580Rename flag and make some minor adjustments.Gravatar Chris Plummer 5 weeks
pr/4587Initial implementationGravatar Thomas Schatzl 5 weeks
pr/4586Fix young gc verify stagesGravatar Thomas Schatzl 5 weeks
pr/4588trackerGravatar Albert Yang 5 weeks
pr/45858269303: Remove unnecessary forward declaration of PSPromotionManager in cpCa...Gravatar Zhengyu Gu 5 weeks
pr/4573remove useless importGravatar Denghui Dong 5 weeks
pr/45848269293: ObjectMonitor thread id fields should be 64 bits.Gravatar Coleen Phillimore 5 weeks
pr/4549Add some more cases to TestObjectSizeGravatar Ludovic Henry 5 weeks
pr/4583remove invalid assertionGravatar mgronlun 5 weeks
pr/45818269280: (bf) Replace StringBuffer in "X-Buffer".toString()Gravatar Aleksey Shipilev 5 weeks
pr/45896633375: FileOutputStream_md.c should be merged into FileOutputStream.cGravatar Brian Burkhalter 5 weeks
pr/4579MergeGravatar Jesper Wilhelmsson 5 weeks
pr/4577import cleanup in SupportedGroupsExtensionGravatar Jack Hartstein 5 weeks
pr/4576Fix string name for promptGravatar Yumin Qi 5 weeks
pr/45788266407: remove jdk.internal.javac.PreviewFeature.Feature.SEALED_CLASSESGravatar Vicente Romero 5 weeks
pr/4522fix cast in added whitebox method after 8268368Gravatar Patricio Chilano Mateo 5 weeks
pr/45758269186: [REDO] Remove CodeCache::mark_for_evol_deoptimization() methodGravatar Coleen Phillimore 5 weeks
pr/4569Missed ShenandoahControlThreadGravatar David Holmes 5 weeks
pr/4432Implemented reviw comments.Gravatar Mahendra Chhipa 5 weeks
pr/4558Adds requires compiler2 & revert compilation level detection.Gravatar Christoph Göttschkes 5 weeks
pr/4474remove unnecessally comments and add eof lineGravatar Yano, Masanori 5 weeks
pr/45708269216: Useless initialization in com/sun/crypto/provider/PBES2Parameters.javaGravatar Aleksey Shipilev 5 weeks
pr/4566A small typo in comment in test/lib/sun/hotspot/WhiteBox.javaGravatar miao zheng 5 weeks
pr/4563Revert "8264941: Remove CodeCache::mark_for_evol_deoptimization() method"Gravatar Coleen Phillimore 5 weeks
pr/4562MergeGravatar Jesper Wilhelmsson 5 weeks
pr/3980Fix INT32_MIN and cache padding.Gravatar Coleen Phillimore 5 weeks
pr/4560JDK-8260540Gravatar Alex Menkov 5 weeks
pr/45438269074: Minor restructuringGravatar Brian Burkhalter 5 weeks
pr/4551Much simpler fixGravatar Aleksey Shipilev 5 weeks
pr/45598269138: Move typeArrayOop.inline.hpp include to vectorSupport.cppGravatar Aleksey Shipilev 5 weeks
pr/4564add <pid> for jfr dump fileGravatar Hamlin-Li 5 weeks
pr/4557Initial commit - remove sparseprt.inline.hppGravatar Thomas Schatzl 5 weeks
pr/4497remove senseless commentGravatar Harold Seigel 5 weeks
pr/4556Update copyright year.Gravatar Christoph Göttschkes 5 weeks
pr/4571Initial commit - rename G1AllowPreventiveGC to G1UsePreventiveGCGravatar Thomas Schatzl 5 weeks
pr/4548Add comment about as versionGravatar MBaesken 5 weeks
pr/4546Remove inline specifierGravatar Guoxiong Li 5 weeks
pr/4540Use the Platform class from testlib to check if tiered is supported or not.Gravatar Christoph Göttschkes 5 weeks
pr/4541kbarrett reviewGravatar Thomas Schatzl 5 weeks
pr/4505Add more details in commentsGravatar Joshua Zhu 5 weeks
pr/4424fix the code styleGravatar dongbohe 5 weeks
pr/4547Clarifying docs on Scanner.hasNextLine() regarding line separatorsGravatar Ian Graves 5 weeks
pr/4545MergeGravatar Jesper Wilhelmsson 5 weeks
pr/45428266901: Clarify the method description of Duration.toDaysPart()Gravatar Naoto Sato 5 weeks
pr/44908268727: Remove unused slowpath locking method in OptoRuntimeGravatar miao zheng 5 weeks
pr/45388269077: TestSystemGC uses @require vm.gc.G1 for large pages subtestGravatar Stefan Karlsson 5 weeks
pr/4537Remove the entry of output in AsyncLogWriter when delete the output.Gravatar Xin Liu 5 weeks
pr/4523Merge branch 'master' into JDK-8263926Gravatar Guoxiong Li 6 weeks
pr/4535Updated tests to allow CompiledMethodLoad/Unload event to be sent in start phaseGravatar Alex Menkov 6 weeks
pr/4533MergeGravatar Jesper Wilhelmsson 6 weeks
pr/4532IOPipe.quit should check if the pipe is connectedGravatar Alex Menkov 6 weeks
pr/4531Initial commitGravatar Thomas Schatzl 6 weeks
pr/4530Update copyright year.Gravatar Christoph Göttschkes 6 weeks
pr/44138266182: Create a manual test for jdk/sun/security/pkcs12/ParamsTest.javaGravatar akolarkunnu 6 weeks
pr/4116iwalulya review - commentsGravatar Thomas Schatzl 6 weeks
pr/4527remove lineGravatar Nils Eliasson 6 weeks
pr/4529Initial versionGravatar Thomas Schatzl 6 weeks
pr/4504updateGravatar Denghui Dong 6 weeks
pr/4408Fix VC++ warning C4099Gravatar Xin Liu 6 weeks
pr/4525MergeGravatar Jesper Wilhelmsson 6 weeks
pr/45248268678: LetsEncryptCA.java test fails as Let’s Encrypt Authority X3 is ret...Gravatar Rajan Halade 6 weeks
pr/3250@apiNote added, Suggests -> RequestsGravatar Aleksandr Zvegintsev 6 weeks
pr/4515comments from @calvinccheung and @yminqiGravatar iklam 6 weeks
pr/4519atomic-discoveryGravatar Albert Yang 6 weeks
pr/36192nd proposalGravatar Toshio Nakamura 6 weeks
pr/45168268927: Windows: link error: unresolved external symbol "int __cdecl convert...Gravatar David Holmes 6 weeks
pr/4514MergeGravatar Jesper Wilhelmsson 6 weeks
pr/4517initial changeGravatar Julia Boes 6 weeks
pr/45128268902: Testing for threadObj != NULL is unnecessary in handshakeGravatar Coleen Phillimore 6 weeks
pr/4291Zooming now actually keeps the current centered point in the centerGravatar James Fuller 6 weeks
pr/45118259066: Obsolete -XX:+AlwaysLockClassLoaderGravatar Coleen Phillimore 6 weeks
pr/45098264941: Remove CodeCache::mark_for_evol_deoptimization() methodGravatar Coleen Phillimore 6 weeks
pr/4506Merge branch 'master' into websocketGravatar Michael-Mc-Mahon 6 weeks
pr/3976address review commentsGravatar Aleksei Voitylov 6 weeks
pr/44838266082: Test more casesGravatar Joel Borggrén-Franck 6 weeks
pr/4508c1 code cleanupGravatar Yi Yang 6 weeks
pr/4173Fix CHECK_NULL.Gravatar Coleen Phillimore 6 weeks
pr/45038268852: AsyncLogWriter should not overide is_Named_thread()Gravatar Xin Liu 6 weeks
pr/4498revert the changes for freeing the _id2klass_tableGravatar Calvin Cheung 6 weeks
pr/45008259338: Add expiry exception for identrustdstx3 alias to VerifyCACerts.java ...Gravatar Rajan Halade 6 weeks
pr/4485tweak whitespaceGravatar Kim Barrett 6 weeks
pr/4499Merge jdk17Gravatar Jesper Wilhelmsson 6 weeks
pr/44958268780: Use 'print_cr' instead of 'print' for the message 'eliminated <owner...Gravatar Denghui Dong 6 weeks
pr/44948268778: CDS check_excluded_classes needs DumpTimeTable_lockGravatar iklam 6 weeks
pr/4492Revert idea.shGravatar Maurizio Cimadamore 6 weeks
pr/4362set_subtree_ctrl()Gravatar Christian Hagedorn 6 weeks
pr/4388commentGravatar rwestrel 6 weeks
pr/4387reviewGravatar rwestrel 6 weeks
pr/4479Use AsyncLogWriter::_instance->_lock directly.Gravatar Xin Liu 6 weeks
pr/4359added newline at eofGravatar Nils Eliasson 6 weeks
pr/4487Replace usages of Collection.toArray() with Collection.toArray(T[]) to avoid ...Gravatar Andrey Turbanov 6 weeks
pr/45018267752: KVHashtable doesn't deallocate entriesGravatar Coleen Phillimore 6 weeks
pr/4486v0Gravatar Zhengyu Gu 6 weeks
pr/4379Merge branch 'master' into lfqueueGravatar Kim Barrett 6 weeks
pr/44848267579: Thread::cooked_allocated_bytes() hits assert(left >= right) failed: ...Gravatar Markus Grönlund 6 weeks
pr/4482[PATCH] Unnecessary Vector usage in java.baseGravatar Andrey Turbanov 6 weeks
pr/42068266079: Lanai: AlphaComposite shows differences on Metal compared to OpenGLGravatar Alexey Ushakov 6 weeks
pr/44808268362: [REDO] C2 crash when compile negative Arrays.copyOf length after loopGravatar Hui Shi 7 weeks
pr/1864Use meaningful name. Update copyright.Gravatar Guoxiong Li 7 weeks
pr/1959Merge branch 'master' into JDK-8150303Gravatar Guoxiong Li 7 weeks
pr/2118Use meaningful nameGravatar Guoxiong Li 7 weeks
pr/44778267634: Update --release 17 symbol information for JDK 17 build 26Gravatar Joe Darcy 7 weeks
pr/4476native lib support removed.Gravatar lmesnik 7 weeks
pr/4488Merge branch 'master' into JDK-8268620Gravatar serb 7 weeks
pr/4036Third version of the fixGravatar Anton Litvinov 7 weeks
pr/4473Initial versionGravatar Thomas Schatzl 7 weeks
pr/4471Initial commitGravatar Thomas Schatzl 7 weeks
pr/4416addressing review changesGravatar Vicente Romero 7 weeks
pr/44708257038: Remove expired flags in JDK 18Gravatar David Holmes 7 weeks
pr/43928268293: Moving legality logic from test-generation script to java AbstractVe...Gravatar Jatin Bhateja 7 weeks
pr/44688268565Gravatar iignatyev 7 weeks
pr/4467fix trailing whitespaceGravatar Calvin Cheung 7 weeks
pr/44668268525: Some new memory leak after JDK-8248268 and JDK-8255557Gravatar Weijun Wang 7 weeks
pr/39378268549: Typo in file name in example for -Xlint:processingGravatar Piotrek Żygieło 7 weeks
pr/44658268555: Update HttpClient tests that use ITestContext to jtreg 6+1Gravatar Daniel Fuchs 7 weeks
pr/4175Merge branch 'master' into 8267630Gravatar Joe Darcy 7 weeks
pr/4459JDK-8262886: Fix copyright headersGravatar Hannes Wallnoefer 7 weeks
pr/39408266791: Annotation property which is compiled as an array property but chang...Gravatar Rafael Winterhalter 7 weeks
pr/4414Reviewer feedbackGravatar Erik Gahlin 7 weeks
pr/44638268544Gravatar iignatyev 7 weeks
pr/4462update copyright yearGravatar iignatyev 7 weeks
pr/44618268542Gravatar iignatyev 7 weeks
pr/4460use path to .class file in ClhsdbDumpclassGravatar iignatyev 7 weeks
pr/4458update copyright yearGravatar iignatyev 7 weeks
pr/4312Merge remote-tracking branch 'origin/master' into JDK-8268124Gravatar Patrick Concannon 7 weeks
pr/4457update copyright yearGravatar iignatyev 7 weeks
pr/39258266766: Arrays of types that cannot be an annotation member do not yield exc...Gravatar Rafael Winterhalter 7 weeks
pr/4456InitialGravatar Erik Gahlin 7 weeks
pr/4453update copyright yearGravatar iignatyev 7 weeks
pr/4452check exit code of jar and GetObjectSizeOverflowAgent processesGravatar iignatyev 7 weeks
pr/44518267448Gravatar iignatyev 7 weeks
pr/4450JDK-8261873Gravatar MBaesken 7 weeks
pr/43788268361: Fix the infinite loop in next_lineGravatar UncleNine 7 weeks
pr/4447MergeGravatar Serguei Spitsyn 7 weeks
pr/4443remove extra reference to RFC 2040Gravatar Jack Hartstein 7 weeks
pr/44488268520: VirtualSpace::print_on() should be constGravatar iklam 7 weeks
pr/4444weak_oopsGravatar Albert Yang 7 weeks
pr/44428268478: JVMCI tests failing after JDK-8268052Gravatar Tom Rodriguez 7 weeks
pr/4440Revert "8263928: Add JAWT test files for mac"Gravatar serb 7 weeks
pr/44418268320: Better error recovery for broken patterns in switchGravatar Jan Lahoda 7 weeks
pr/4439test excludedGravatar lmesnik 7 weeks
pr/4234fxiesGravatar lmesnik 7 weeks
pr/44388268475Gravatar iignatyev 7 weeks
pr/4437Ensure there is a header block with RCEGravatar Igor Veresov 7 weeks
pr/4434Move SharedClassLoadingMark to systemDictionaryShared.hppGravatar Yumin Qi 7 weeks
pr/4354Added new line at end of fileGravatar Evan Whelan 7 weeks
pr/4425Stufe review.Gravatar Stefan Johansson 7 weeks
pr/44358268390: G1 concurrent gc upgrade to full gc not workingGravatar Stefan Johansson 7 weeks
pr/4430Remove superfluous whitespace.Gravatar Christoph Göttschkes 7 weeks
pr/3971Update help messageGravatar Jorn Vernee 7 weeks
pr/4418One less File reference.Gravatar Kevin Walls 7 weeks
pr/4427Update wrong copyright dateGravatar Maurizio Cimadamore 7 weeks
pr/4429Redirty logged cards clashed with collection set freeingGravatar Thomas Schatzl 7 weeks
pr/44288266035: class file for sun.misc.Contended not foundGravatar Jan Lahoda 7 weeks
pr/4445JFR: Rework setting and getting EventHandlerGravatar mgronlun 7 weeks
pr/38928266598: Exception values for AnnotationTypeMismatchException are not always ...Gravatar Rafael Winterhalter 7 weeks
pr/4426JDK-8268377Gravatar MBaesken 7 weeks
pr/4278remove useless line from testGravatar rwestrel 7 weeks
pr/3615more commentGravatar Yi Yang 7 weeks
pr/4285Merge remote-tracking branch 'origin/master' into JDK-8268056Gravatar Patrick Concannon 7 weeks
pr/4267Revert changes for pusing nodes in loadConLNodesTuple and add comments about ...Gravatar Kazurnori OGATA 7 weeks
pr/4371avoid reloading forwardeeGravatar Kim Barrett 7 weeks
pr/3670Merge masterGravatar Wanghuang-Huawei 7 weeks
pr/44228268424: JFR tests fail due to GC cause 'G1 Preventive Collection' not in the...Gravatar Jie Fu 7 weeks
pr/3626Changes to keep home_dtd null check.Gravatar ScientificWare 7 weeks
pr/4421Improve test.Gravatar Paul Sandoz 7 weeks
pr/43738267430: GraphicsDevice.setDisplayMode(REFRESH_RATE_UNKNOWN) throws IAE: Unab...Gravatar prrace 7 weeks
pr/44208268417: Add test from JDK-8268360Gravatar Vladimir Kozlov 7 weeks
pr/4419Problemlist jstatLineCounts*.sh tests on linux-aarch64Gravatar Chris Plummer 7 weeks
pr/44178264866: Remove unneeded WorkArounds.isAutomaticModuleGravatar Joe Darcy 7 weeks
pr/4406list deprecation of Heap functions 1.0 at end of jvmti.xmlGravatar Serguei Spitsyn 7 weeks
pr/4396Suggest try/catch Throwable in upcallStub javadocGravatar Jorn Vernee 7 weeks
pr/4415Merge branch 'master' into JDK-8264144Gravatar Alexey Semenyuk 7 weeks
pr/4237ProblemList vmTestbase/nsk/jvmti/SuspendThread/suspendthrd003/TestDescription...Gravatar Daniel D. Daugherty 7 weeks
pr/4256Update help textGravatar Henry Jen 7 weeks
pr/4403Clean up validation of implKind REF_invokeSpecialGravatar Dan Smith 7 weeks
pr/4320Added extra lineGravatar Zhengyu Gu 7 weeks
pr/4386Fixed resouce closing issue for lib/moduls file. Pre-existing output director...Gravatar Sundararajan Athijegannathan 7 weeks
pr/3996Clarify exceptions that occur if initializing the filter factory from jdk.ser...Gravatar Roger Riggs 7 weeks
pr/4306JDK-8267764: jpackage cannot handle window screensaver files when EXE renamed...Gravatar Andy Herrick 7 weeks
pr/3969Feedback ColeenGravatar tstuefe 7 weeks
pr/4411remove incorrect castsGravatar mgronlun 7 weeks
pr/4358small fixGravatar Eric Liu 7 weeks
pr/4410ZGC: Dynamic number of GC threadsGravatar Per Liden 7 weeks
pr/4409testGravatar rwestrel 7 weeks
pr/3973Fixed CW headerGravatar Robbin Ehn 7 weeks
pr/4352Change "Oracle VM" to just "VM"Gravatar Chris Plummer 7 weeks
pr/4356fix review comment on testGravatar aghaisas 7 weeks
pr/44078267908: linux: thread_native_entry can scribble on stack frameGravatar David Holmes 7 weeks
pr/4405JDK-8268352: Rename javadoc Messager class to JavadocLogGravatar Jonathan Gibbons 7 weeks
pr/4404JDK-8267187: Remove deprecated constructor for LogGravatar Jonathan Gibbons 7 weeks
pr/44028267556: Enhance class paths check during runtimeGravatar Calvin Cheung 7 weeks
pr/4327@coleenp comments; clean upGravatar iklam 7 weeks
pr/4399Fix type from last commitGravatar Chris Plummer 7 weeks
pr/44018268093: Manual Testcase: "sun/security/krb5/config/native/TestDynamicStore.j...Gravatar Weijun Wang 7 weeks
pr/44008268349: Provide more detail in JEP 411 warning messagesGravatar Weijun Wang 7 weeks
pr/4209JDK-8263468: review commentsGravatar Hannes Wallnoefer 7 weeks
pr/4011Merge remote-tracking branch 'upstream/master' into 8266967_objectprintGravatar Kevin Walls 7 weeks
pr/43988264766: ClassCastException during template compilation (Variable cannot be c...Gravatar JoeWang-Java 7 weeks
pr/43458232948: Test should work with different EOL encondingsGravatar Joel Borggrén-Franck 7 weeks
pr/4383Remove whitespace.Gravatar Jiangli Zhou 7 weeks
pr/4395Pt1Gravatar Jorn Vernee 7 weeks
pr/42798261549: Adjust memory size in MTLTexurePool.mGravatar Alexey Ushakov 7 weeks
pr/4394Remove unused importGravatar Roberto Castañeda Lozano 7 weeks
pr/43978268333: javac crashes when pattern matching switch contains default case whi...Gravatar Jan Lahoda 7 weeks
pr/4363read onceGravatar mgronlun 7 weeks
pr/4360Improving javadoc as suggested on the review.Gravatar Jan Lahoda 7 weeks
pr/4391Revert "8267924: Misleading G1 eager reclaim detail logging"Gravatar Thomas Schatzl 7 weeks
pr/4390Upstream 8268169: The system lookup can not find stdio functions such as prin...Gravatar Jorn Vernee 7 weeks
pr/4142JDK-8266748: Use configuration instead of writer where possibleGravatar Hannes Wallnoefer 7 weeks
pr/43378268178: Extract sender frame parsing to CodeBlock::FrameParserGravatar Ludovic Henry 7 weeks
pr/4113Changed the check for the XDecoratedPeer target being javax.swing.RootPaneCon...Gravatar Maxim Kartashev 7 weeks
pr/4357Move compaction cause in enum to under evacuation cause.Gravatar Stefan Johansson 7 weeks
pr/4305Some more refactoring, sjohanns, ayang reviewsGravatar Thomas Schatzl 7 weeks
pr/2803Merge branch 'master' into sadump-fixGravatar linzang 7 weeks
pr/4223Merging master into JDK-8267833Gravatar Jan Lahoda 7 weeks
pr/4384Revert "8267904: C2 crash when compile negative Arrays.copyOf length after loop"Gravatar Hui Shi 7 weeks
pr/4382Add missing ending newline.Gravatar Joe Darcy 7 weeks
pr/43818268299: jvms tag produces incorrect URLGravatar Joe Darcy 7 weeks
pr/43808268296: ScopedMemoryAccess build error with readonly filesystemsGravatar Liam Miller-Cushon 7 weeks
pr/43778268292: compiler/intrinsics/VectorizedMismatchTest.java fails with release VMsGravatar Jie Fu 8 weeks
pr/43758268289: build failure due to missing signed flag in x86 evcmpb instructionGravatar Jatin Bhateja 8 weeks
pr/4372Update issue numberGravatar Yasumasa Suenaga 8 weeks
pr/4346Fix stray renamingGravatar Dan Smith 8 weeks
pr/43708268279: gc/shenandoah/compiler/TestLinkToNativeRBP.java fails after LibraryL...Gravatar Xin Liu 8 weeks
pr/4216use printRawLines instead of println for correct newline handline on WindowsGravatar Jonathan Gibbons 8 weeks
pr/4339renamed socketSupported() to init()Gravatar Michael-Mc-Mahon 8 weeks
pr/43698268083: Got rid of realpath usage in bin/idea.shGravatar Nikita Gubarkov 8 weeks
pr/4332Merge branch 'master' into JDK-8268165Gravatar Xin Liu 8 weeks
pr/3863Applying review feedback.Gravatar Jan Lahoda 8 weeks
pr/43678268272: Remove JDK-8264874 changes because Graal was removed.Gravatar Vladimir Kozlov 8 weeks
pr/43648268267: Remove -Djavatest.security.noSecurityManager=true from jtreg runsGravatar Weijun Wang 8 weeks
pr/3617Fix build after mergeGravatar Nick Gasson 8 weeks
pr/3407call on testApp on correct threadGravatar trebari 8 weeks
pr/4029Remove movs from asmGravatar Alan Hayward 8 weeks
pr/3979Replace check by assertionGravatar MBaesken 8 weeks
pr/4169Updated the test to run on Windows only and to use a character from theGravatar Maxim Kartashev 8 weeks
pr/4251shortcuts for small valuesGravatar Richard Startin 8 weeks
pr/4355Disable VerifyDependencies on TestUpcall/Downcall (when in debug mode)Gravatar Maurizio Cimadamore 8 weeks
pr/3508Update test and example package names, README files and fix some tests to let...Gravatar Christian Hagedorn 8 weeks
pr/4253rerun testsGravatar Leo Korinth 8 weeks
pr/43618267972: Inline cache cleaning is not monotonicGravatar Erik Österlund 8 weeks
pr/4072merge, and a few nitsGravatar Anthony Scarpino 8 weeks
pr/4322@calvinccheung commentsGravatar iklam 8 weeks
pr/4350Fix commentsGravatar Yasumasa Suenaga 8 weeks
pr/43538268222: javax/xml/jaxp/unittest/transform/Bug6216226Test.java failed, cannot...Gravatar JoeWang-Java 8 weeks
pr/4188mixed computations loopGravatar Yi Yang 8 weeks
pr/43518238213: Method resolution should stop on static errorGravatar Vicente Romero 8 weeks
pr/4141Update SetPositionHang.javaGravatar mrserb 8 weeks
pr/4238remove not needed record_for_igvnGravatar Hui Shi 8 weeks
pr/4349Reflow paragraphs.Gravatar Joe Darcy 8 weeks
pr/4326Implement review commentsGravatar Sandhya Viswanathan 8 weeks
pr/4331updated test.Gravatar lmesnik 8 weeks
pr/4296Update JPasswordField.javaGravatar mrserb 8 weeks
pr/43478268214: Use system zlib and disable dtrace when building linux-aarch64 at Or...Gravatar Mikael Vidstedt 8 weeks
pr/40168266846: Add java.time.InstantSourceGravatar Stephen Colebourne 8 weeks
pr/4316Address review comments on shim lib makefileGravatar Maurizio Cimadamore 8 weeks
pr/39998266951: Review comments resolution.Gravatar Jatin Bhateja 8 weeks
pr/4341Merge branch 'master' into 8268142-macos-aarch64-jdk17Gravatar Mikael Vidstedt 8 weeks
pr/43408267995: Add reference to JVMS class file format in Lookup::defineHiddenClassGravatar Mandy Chung 8 weeks
pr/3638Merge masterGravatar Sandhya Viswanathan 8 weeks
pr/43388268095: CDS MethodHandle tests should add -XX:-VerifyDependenciesGravatar Calvin Cheung 8 weeks
pr/4330Merge branch 'master' into JDK-8267465Gravatar Vicente Romero 8 weeks
pr/4203JDK-8267598: jpackage removes system libraries from java.library.pathGravatar Andy Herrick 8 weeks
pr/43428268163: Change the order of fallback full GCs in G1Gravatar Stefan Johansson 8 weeks
pr/4334reviewGravatar Albert Yang 8 weeks
pr/4335Build fixGravatar Vladimir Ivanov 8 weeks
pr/43338268167: MultipleLogins.java failure on macosx-aarch64Gravatar Seán Coffey 8 weeks
pr/4317Implemented tge review comments.Gravatar Mahendra Chhipa 8 weeks
pr/4257Revert back to the basic bugfix and remove AsyncLogGtest.java from ProblemList.Gravatar Xin Liu 8 weeks
pr/4328JDK-8268150: tier2: test/jdk/tools/jpackage/junit/junit.java needs updating f...Gravatar Jonathan Gibbons 8 weeks
pr/4277#ifdef SYS_get_mempolicy in numa_syscall_checkGravatar Jie Fu 8 weeks
pr/4290Use source of elements.Gravatar Paul Sandoz 8 weeks
pr/4321* Increase timeout for TestUpcall/DowncallGravatar Maurizio Cimadamore 8 weeks
pr/4183Fix windows flags (although complied fine)Gravatar Anton Kozlov 8 weeks
pr/4315Update copyright yearsGravatar Jonathan Gibbons 8 weeks
pr/3143Revert test change and instead disable preventive GC for evac failure cases.Gravatar Aditya Mandaleeka 8 weeks
pr/43188266019: StreamResult(File) writes to incorrect file path if # is part of the...Gravatar JoeWang-Java 8 weeks
pr/3803Check vlen in bytes for unsigned supportGravatar Paul Sandoz 8 weeks
pr/4295Tiny editorial tweaks.Gravatar Stuart Marks 8 weeks
pr/2404Add AESWrapPad alias for AES with KWP mode for better interoperability and up...Gravatar Valerie Peng 8 weeks
pr/4313Add a comment for the non-obvious case where ni1 == null || ni2 == nullGravatar Daniel Fuchs 8 weeks
pr/3399Encapsulate common code to a methodGravatar Guoxiong Li 8 weeks
pr/4134Editorial improvements in outputWriter and inputReader.Gravatar Roger Riggs 8 weeks
pr/4126Remove invalid assertsGravatar Erik Gahlin 8 weeks
pr/43108268118: Rename bytes_os_cpu.inline.hpp files to bytes_os_cpu.hppGravatar Stefan Karlsson 8 weeks
pr/43118268119: Rename copy_os_cpu.inline.hpp files to copy_os_cpu.hppGravatar Stefan Karlsson 8 weeks
pr/43078264305: Create implementation for native accessibility peer for Statusbar ja...Gravatar Pankaj Bansal 8 weeks
pr/4308replace thread.sleep with countdownlatchGravatar Fernando Guallini 8 weeks
pr/43368265444: Javadocs: jdk.jshell - small typoGravatar Jan Lahoda 8 weeks
pr/4303Add newlineGravatar Maurizio Cimadamore 8 weeks
pr/4243Merge remote-tracking branch 'origin/master' into 8267914_events_vmoperationsGravatar Stefan Karlsson 8 weeks
pr/4225Thomas review.Gravatar Stefan Johansson 8 weeks
pr/43028268094: Some vmTestbase/nsk tests fail after ACC_STRICT/strictfp changesGravatar David Holmes 8 weeks
pr/43018226362: langtools ProblemList file contains more than 1 entry for a testGravatar Joel Borggrén-Franck 8 weeks
pr/43008268103: JNI functions incorrectly return a double after JDK-8265836Gravatar Severin Gehwolf 8 weeks
pr/4240castGravatar Albert Yang 8 weeks
pr/42998268098: jdk.CPULoad event reports incorrect CPU usage inside a containerGravatar Yasumasa Suenaga 8 weeks
pr/4298Update the copyrightGravatar Kochi Sakata 8 weeks
pr/4297Should the logging output in the test log so we can check its contents even w...Gravatar David Holmes 8 weeks
pr/4272Merge branch 'jdk:master' into JDK-8267969Gravatar Xiaohong Gong 8 weeks
pr/4292strdup_check_oom is used instead of strdup.Gravatar lmesnik 8 weeks
pr/4266Merge branch 'master' into 8267118-oomeGravatar David Holmes 8 weeks
pr/42948267861: Update SourceVersion with new language features in 16 and 17Gravatar Joe Darcy 8 weeks
pr/3991Merge branch 'master' into jep-306Gravatar David Holmes 8 weeks
pr/4258Put Number in @code tag. Thanks Naoto.Gravatar JoeWang-Java 8 weeks
pr/3831Fix copyright typo.Gravatar Joe Darcy 8 weeks
pr/3891Merge branch 'master' into 8266530Gravatar Joe Darcy 8 weeks
pr/42898268077: java.util.List missing from Collections Framework OverviewGravatar Raffaello Giulietti 8 weeks
pr/42328267569: Change @implNote to @apiNoteGravatar Brian Burkhalter 8 weeks
pr/42868267879: ClassLoaderMetaspace destructor asserts on !_frozenGravatar iklam 8 weeks
pr/4265Incorporated comment suggestion from Thomas.Gravatar Jiangli Zhou 8 weeks
pr/3699Merge branch 'master' into JEP-412Gravatar Maurizio Cimadamore 8 weeks
pr/4287[TESTBUG] cds DynamicLoaderConstraintsTest.java timed outGravatar iklam 8 weeks
pr/4284JDK-8149138: [javadoc] Fix SerialFormBuilder eliminate String bashingGravatar Hannes Wallnoefer 8 weeks
pr/42838268052: [JVMCI] non-default installed code must be marked as in_useGravatar Tom Rodriguez 8 weeks
pr/4073merge from masterGravatar Weijun Wang 8 weeks
pr/4128Merging master into JDK-8267459Gravatar Jan Lahoda 8 weeks
pr/4329JDK-8268018: remove dead code in commitLimitterGravatar Hamlin-Li 8 weeks
pr/4260fix wrong argument orderGravatar Hamlin Li 8 weeks
pr/42818268023: Improve diagnostic for HandshakeFailureTestGravatar Daniel Fuchs 8 weeks
pr/4269Refactor assertsGravatar Vladimir Ivanov 8 weeks
pr/4182Merge remote-tracking branch 'origin/master' into JDK-8267670Gravatar Patrick Concannon 8 weeks
pr/42758267990: Revisit some uses of `synchronized` in the HttpClient APIGravatar Daniel Fuchs 8 weeks
pr/4274JDK-8267985: Allow AsyncGetCallTrace and JFR to walk a stub frameGravatar Ludovic Henry 8 weeks
pr/4273JDK-8246351: <code> elements in headings are of incorrect sizeGravatar Hannes Wallnoefer 8 weeks
pr/4255Remove testGravatar Nils Eliasson 8 weeks
pr/4248lkorinth reviewGravatar Thomas Schatzl 8 weeks
pr/4008Improve READMEGravatar Vladimir Ivanov 8 weeks
pr/4271FixGravatar Vladimir Ivanov 8 weeks
pr/4270JDK-8259806: Clean up terminology on the "All Classes" pageGravatar Hannes Wallnoefer 8 weeks
pr/4242Merge remote-tracking branch 'origin/master' into 8267914_remove_DeferredObje...Gravatar Stefan Karlsson 8 weeks
pr/4127Merge remote-tracking branch 'origin/master' into 8267464_circular-dependency...Gravatar Stefan Karlsson 8 weeks
pr/4245Merging with test for long time existing behavior of -XX:+PreserveAllAnnotationsGravatar Jaroslav Tulach 8 weeks
pr/4280Test long time existing behavior of -XX:+PreserveAllAnnotationsGravatar Jaroslav Tulach 8 weeks
pr/4161Rollback changes in j.u.concurrent (including formatting)Gravatar Tagir Valeev 8 weeks
pr/4261JDK-8267934: remove dead code in CLDGravatar Hamlin-Li 2 months
pr/42628267953: restore 'volatile' to ObjectMonitor::_owner fieldGravatar Daniel D. Daugherty 2 months
pr/42548264800: cleanup Threads_lock comments in JVM/TI function headersGravatar Daniel D. Daugherty 2 months
pr/42528267945: ZGC: Revert NUMA changes (JDK-8266217 and JDK-8241354) after JDK-824...Gravatar Jie Fu 2 months
pr/4250JDK-8247608: Javadoc: CSS margin is not applied consistentlyGravatar Hannes Wallnoefer 2 months
pr/3544whitespaceGravatar Seán Coffey 2 months
pr/4224Improve comments.Gravatar Martin Doerr 2 months
pr/4249Initial commitGravatar Thomas Schatzl 2 months
pr/4246Initial changesGravatar Chris Hegarty 2 months
pr/4090Albert review. Harden test to not allow failure for request addressGravatar Stefan Johansson 2 months
pr/42448266239: Some duplicated javac command-line options have repeated effectGravatar Guoxiong Li 2 months
pr/4092Merge branch 'master' into 8180571Gravatar Fernando Guallini 2 months
pr/42688267921: Remove redundant loop from sun.reflect.misc.ReflectUtil.privateCheck...Gravatar Sergey Tsypanov 2 months
pr/4247compute_trip_countGravatar Yi Yang 2 months
pr/42418267917Gravatar iignatyev 2 months
pr/42398267375: Aarch64: JVM crashes with option -XX:PrintIdealGraphLevel=3 on SVE b...Gravatar Wanghuang-Huawei 2 months
pr/42368264624: change the guarantee() calls added by JDK-8264123 to assert() callsGravatar Daniel D. Daugherty 2 months
pr/4235FIx for serviceability/dcmd/framework testsGravatar Alex Menkov 2 months
pr/4233fix whitespaceGravatar Jonathan Gibbons 2 months
pr/4228Add join of zero strings, clarify commentGravatar Claes Redestad 2 months
pr/41908267706: Break long line in make/ide/idea/jdk/idea.gmkGravatar Nikita Gubarkov 2 months
pr/4230Fix array_copy_requires_gc_barriersGravatar Nils Eliasson 2 months
pr/4227Add bug id to Timeout.java jtreg headerGravatar Aleksei Efimov 2 months
pr/4229Merge branch 'master' into sh-c2-ideal-simplifyGravatar Zhengyu Gu 2 months
pr/4222Added missing spaces after catchGravatar Daniel Fuchs 2 months
pr/42268267845: Add @requires to avoid running G1 large pages test with wrong page sizeGravatar Stefan Johansson 2 months
pr/35718265418: Compare package names with == instead of equals()Gravatar Сергей Цыпанов 2 months
pr/41498267555: Fix class file version during redefinition after 8238048Gravatar Volker Simonis 2 months
pr/42218240347: remove undocumented options from jlink --help messageGravatar Sundararajan Athijegannathan 2 months
pr/42208179880: Refactor javax/security shell tests to plain java testsGravatar Sibabrata Sahoo 2 months
pr/1758Improve the text in the resource fileGravatar Guoxiong Li 2 months
pr/4218test cleanupGravatar Boris Ulasevich 2 months
pr/3135Correct typos and add a comment for a corner case.Gravatar Xin Liu 2 months
pr/42018267686: C2: PrintIdealGraphFile supports parameterizationGravatar ryan 2 months
pr/3427Clarifying commentsGravatar Tagir Valeev 2 months
pr/4217space removed.Gravatar lmesnik 2 months
pr/42158267817: [TEST] Remove unnecessary init in test/micro/org/openjdk/bench/javax...Gravatar dongbohe 2 months
pr/2875Test comment fixed.Gravatar Alexander Zuev 2 months
pr/4168Rewind and remove the unused hash_table_size calculations; ThreadScanHashtabl...Gravatar Daniel D. Daugherty 2 months
pr/4214Test caseGravatar Vladimir Ivanov 2 months
pr/4213Test caseGravatar Vladimir Ivanov 2 months
pr/4197Removed unintended classfileGravatar Roger Riggs 2 months
pr/4212Validate receiver type against target methodGravatar Vladimir Ivanov 2 months
pr/4167inlineGravatar Albert Yang 2 months
pr/4219numa.leakGravatar Hamlin-Li 2 months
pr/42088267800: Remove the '_dirty' set in BCEscapeAnalyzerGravatar Denghui Dong 2 months
pr/4205Remove os::Linux namespace for numa_syscall_check()Gravatar Jie Fu 2 months
pr/42078267721: Enable sun/security/pkcs11 tests for Amazon Linux 2 AArch64Gravatar Evgeny Astigeevich 2 months
pr/4163Review kbarrettGravatar Stefan Karlsson 2 months
pr/42028267583: jmod fails on symlink to class fileGravatar Sundararajan Athijegannathan 2 months
pr/4181Correct small issueGravatar Pankaj Bansal 2 months
pr/4198Use Platform.areCustomLoadersSupportedForCDSGravatar Jie Fu 2 months
pr/41998267353: java/net/SctpSanity.java fails due to Protocol not supportedGravatar Jie Fu 2 months
pr/4184Add assert that the thread is terminated before taking Heap_lockGravatar Coleen Phillimore 2 months
pr/41968267750: Incomplete fix for JDK-8267683Gravatar Bradford Wetmore 2 months
pr/4195polish testGravatar Jonathan Gibbons 2 months
pr/4192Fix issues found by a repaired testGravatar pavelrappo 2 months
pr/41938267683: rfc7301Grease8F value not displayed correctly in SSLParameters javadocGravatar Bradford Wetmore 2 months
pr/3656Use historical-value-based formula for both cpu-quota-based and cpu-shares-ba...Gravatar Hao Tang 2 months
pr/4172one more changeGravatar Weijun Wang 2 months
pr/4189fix for C2 compilation fails with assert missing precedence edgeGravatar jamsheed_c_m 2 months
pr/2744Merge branch 'master' into purge-linked-listGravatar Сергей Цыпанов 2 months
pr/41868263445: Duplicate key compiler.err.expected.module in compiler.propertiesGravatar Adam Sotona 2 months
pr/41858267691: Change table to obsolete CriticalJNINatives in JDK 18, not 17Gravatar Coleen Phillimore 2 months
pr/41878267221: jshell feedback is incorrect when creating method with array varargs...Gravatar Jan Lahoda 2 months
pr/4211Relax inlining checks in C1Gravatar Vladimir Ivanov 2 months
pr/4174Remove inconsistent whitespace in <li>Gravatar pavelrappo 2 months
pr/4194Merge branch 'master' into JDK-8267123-Remove-RMI-ActivationGravatar Stuart Marks 2 months
pr/3875Fixes for DanGravatar Robbin Ehn 2 months
pr/41808255674 SSLEngine class description is missing "case" in switch statementGravatar jpai 2 months
pr/41918187649: ArrayIndexOutOfBoundsException in java.util.JapaneseImperialCalendarGravatar Naoto Sato 2 months
pr/4179trailing whitespacesGravatar Yi Yang 2 months
pr/3470Merge remote-tracking branch 'github/master' into get_class_idGravatar Denghui Dong 2 months
pr/41778267651: runtime/handshake/HandshakeTimeoutTest.java times out will dumping coreGravatar David Holmes 2 months
pr/4164Mandy reviewGravatar Claes Redestad 2 months
pr/4210Make UseVtableBasedCHA known to jtregGravatar Vladimir Ivanov 2 months
pr/4074fix typosGravatar Jonathan Gibbons 2 months
pr/4133Minor fixes.Gravatar Joe Darcy 2 months
pr/41708261478: InstanceKlass::set_classpath_index does not match commentsGravatar Calvin Cheung 2 months
pr/4147Merge branch 'master' into 8267347-record_linking_constraint-assertsGravatar iklam 2 months
pr/2294MessageHeaderTest add comma to copyright yearGravatar Evan Whelan 2 months
pr/4071Merge branch 'master' into 8267184Gravatar Weijun Wang 2 months
pr/4088Merge remote-tracking branch 'origin/master' into JDK-8267110Gravatar Patrick Concannon 2 months
pr/42598267616: AArch64: Fix AES assertion messages in stubGenerator_aarch64.cppGravatar Dong Bo 2 months
pr/41668265431: Add -fdelete-null-pointer-checks to clang buildsGravatar Maxim Kartashev 2 months
pr/4144JDK-8267423: Fix copyrights in jpackage testsGravatar Andy Herrick 2 months
pr/3683trivial fix the format comments in add2IGravatar Dong Bo 2 months
pr/4103JDK-8265362 java/net/Socket/UdpSocket.java fails with "java.net.BindException...Gravatar Mark Sheppard 2 months
pr/4001Modify javadoc for consistencyGravatar Mitsuru Kariya 2 months
pr/41628267066: New NSAccessibility peers should return they roles and subroles dire...Gravatar Alexander Zuev 2 months
pr/4165Outline VarHandleGuard exact behavior checksGravatar Claes Redestad 2 months
pr/2509Adding note about the default behavior, as suggested.Gravatar Jan Lahoda 2 months
pr/4124Test: formatting; tests for empty spliteratorGravatar Tagir Valeev 2 months
pr/3644Consolidated impl specific properties; deprecated legacy properties; made new...Gravatar JoeWang-Java 2 months
pr/4028Revert "8262443: GenerateOopMap::do_interpretation can spin for a long time."Gravatar Yude Lin 2 months
pr/4178trivialGravatar Yi Yang 2 months
pr/41608267553: Extra JavaThread assignment in ClassLoader::create_class_path_entry()Gravatar David Holmes 2 months
pr/41598267584: The java.security.krb5.realm system property only needs to be define...Gravatar Weijun Wang 2 months
pr/41588267580: The method JavacParser#peekToken is wrong when the first parameter i...Gravatar Guoxiong Li 2 months
pr/41578267578: Remove unnecessary preview checksGravatar Guoxiong Li 2 months
pr/4153Revise commentGravatar Guoxiong Li 2 months
pr/4156remove assertionGravatar Kim Barrett 2 months
pr/4155JDK-8267575: Add new documentation group in HtmlStyleGravatar Jonathan Gibbons 2 months
pr/4154JDK-8267574: Dead code in HtmlStyle/HtmlDocletWriterGravatar Jonathan Gibbons 2 months
pr/41528258535: TypeElement#getRecordComponents no components for records from a dif...Gravatar Vicente Romero 2 months
pr/4151Correct API to get list of unique hostnamesGravatar Roger Riggs 2 months
pr/4086Move System.gc() out of generateString()Gravatar Jie Fu 2 months
pr/4138update FtpClient.javaGravatar Weijun Wang 2 months
pr/41488240997: Remove more hack word in security codesGravatar Jack Hartstein 2 months
pr/4143Remove unused filterGravatar jbachorik 2 months
pr/3401Added usage example to javadocGravatar Jorn Vernee 2 months
pr/4140Increase MaxMetaspaceSize to 512kGravatar Jie Fu 2 months
pr/4010remove x/yOffset fieldsGravatar aghaisas 2 months
pr/41458267531: [x86] Assembler::andb(Address,Register) encoding is incorrectGravatar Aleksey Shipilev 2 months
pr/4136Merge branch 'master' into xor_boundGravatar Nils Eliasson 2 months
pr/4135Reordering class modifiersGravatar Gavin Bierman 2 months
pr/41398267403: tools/jpackage/share/FileAssociationsTest.java#id0 failed with "Erro...Gravatar alexander_matveev 2 months
pr/3669Fix typoGravatar Yasumasa Suenaga 2 months
pr/4039Implement review commentsGravatar Sandhya Viswanathan 2 months
pr/41208267056: tools/jpackage/share/RuntimePackageTest.java fails with NoSuchFileEx...Gravatar alexander_matveev 2 months
pr/41378256301: ObjectMonitor::is_busy() should return boolGravatar Daniel D. Daugherty 2 months
pr/4105Merge masterGravatar Ian Graves 2 months
pr/41328267350: Archived old interface extends interface with default method causes ...Gravatar Calvin Cheung 2 months
pr/1153tstuefe reviewGravatar Marcus G K Williams 2 months
pr/4098update testGravatar Jonathan Gibbons 2 months
pr/4131JDK-8267481: Make sure table row has correct number of cellsGravatar Hannes Wallnoefer 2 months
pr/4130JDK-8267394: Do not rely on object identity for empty valid Content instanceGravatar Hannes Wallnoefer 2 months
pr/4146alias mapGravatar Albert Yang 2 months
pr/4040Merge branch 'master' into JDK-8264304Gravatar Pankaj Bansal 2 months
pr/4095Merge branch 'master' into JDK-8261205Gravatar Vicente Romero 2 months
pr/4044cpuinfo_segv should not be triaged as execution protection violationGravatar Jie Fu 2 months
pr/3460Merge masterGravatar Per Liden 2 months
pr/4064final review feedbackGravatar tstuefe 2 months
pr/4121JDK-8267434: Remove LinkOutput[Impl]Gravatar Jonathan Gibbons 2 months
pr/3526Merge branch 'master' into JDK-8260517Gravatar Vicente Romero 2 months
pr/3528Merge branch 'master' into JDK-8265319Gravatar Vicente Romero 2 months
pr/3613manual merge with masterGravatar Vicente Romero 2 months
pr/41198266400: importkeystore fails to a password less pkcs12 keystoreGravatar Hai-May Chao 2 months
pr/4118Adjust constants to match 25KGravatar Aleksey Shipilev 2 months
pr/3126Remove conditinal registration of event hooksGravatar jbachorik 2 months
pr/4068JDK-8264181: Add testGravatar Hannes Wallnoefer 2 months
pr/41178267409 ProblemList gc/epsilon/TestClasses.java on linux-x64Gravatar Daniel D. Daugherty 2 months
pr/41105 threads 3 secsGravatar tstuefe 2 months
pr/4115JDK-8267235: [macos_aarch64] InterpreterRuntime::throw_pending_exception mess...Gravatar Vladimir Kempik 2 months
pr/41148267396: Avoid recording "pc" in unhandled oops detector for better performanceGravatar Aleksey Shipilev 2 months
pr/4109Enable vpmovmskb for 128-bit vectorsGravatar Jie Fu 2 months
pr/4066Specify further what isValid expects and how it is usedGravatar liach 2 months
pr/4085address PR comment: change wordingGravatar Julia Boes 2 months
pr/41118267361: JavaTokenizer reads octal numbers mistakenlyGravatar Guoxiong Li 2 months
pr/4065Merge branch 'master' into fix_citimeGravatar Nils Eliasson 2 months
pr/4099fixed failing testGravatar Doug Simon 2 months
pr/41068267355: Adjust the parameters of the method UnicodeReader#digitGravatar Guoxiong Li 2 months
pr/4070Merge branch 'master' into 8267191-avoid-repeated-should_be_excludedGravatar iklam 2 months
pr/4083missing whitespace; more commentGravatar Yi Yang 2 months
pr/4079unused head->is_CountedLoop()Gravatar Yi Yang 2 months
pr/4104Add bug IDGravatar Jie Fu 2 months
pr/4045Add comments for duplicated input processing in Node::VerifyGravatar Hui Shi 2 months
pr/4080address review feedbackGravatar Jonathan Gibbons 2 months
pr/4069Locale's class description modificationGravatar Naoto Sato 2 months
pr/41718266902: Remove final modifier from static methods in swing.text.UtilitiesGravatar Rajat Mahajan 2 months
pr/4015Fix up IllegalAccessTestGravatar Mark Reinhold 2 months
pr/4101Test flag should be volatileGravatar bchristi 2 months
pr/41088267357: build breaks with -Werror option on micro benchmark added for JDK-82...Gravatar Jatin Bhateja 2 months
pr/4100temporarily disable release_multi_mappings test on macOS x64Gravatar gerard ziemski 2 months
pr/4005Added missing deallocation and renamed "remote" to "non-self".Gravatar Man Cao 2 months
pr/3954Merge remote-tracking branch 'upstream/master' into JDK-8259530Gravatar Jonathan Gibbons 2 months
pr/40978256372: [macos] Unexpected symbol was displayed on JTextField with Monospace...Gravatar prrace 2 months
pr/2782Merge branch 'master' into _8231672Gravatar Leo Korinth 2 months
pr/4102Remove obsolete testGravatar Claes Redestad 2 months
pr/4096Update testGravatar Zhengyu Gu 2 months
pr/40948248843: java in source-file mode suggests javac-only optionsGravatar Adam Sotona 2 months
pr/4091Remove redundant assigment of DeferredType::modeGravatar Maurizio Cimadamore 2 months
pr/40938266480: Implicit null check optimization does not update control of hoisted ...Gravatar Tobias Hartmann 2 months
pr/3901remote LogMinObjAlignmentInBytesGravatar Denghui Dong 2 months
pr/4089Add newlines after factory method/field declarationGravatar Maurizio Cimadamore 2 months
pr/4030Restore save to stack codeGravatar Alan Hayward 2 months
pr/40878267304: Bump global JTReg memory limit to 768mGravatar Aleksey Shipilev 2 months
pr/40848208747: [a11y] [macos] In Optionpane Demo, inside ComponentDialog Example, u...Gravatar Alexander Zuev 2 months
pr/4082Set the original color to OutputSlotGravatar Kochi Sakata 2 months
pr/4076-XX:MaxMetaspaceSize=8mGravatar Jie Fu 2 months
pr/39168256973: Review comments resolution.Gravatar Jatin Bhateja 2 months
pr/3661Documentation improvements and minor reorderingGravatar Martin Balao 2 months
pr/4062Use awk to compute MaxRAMPercentageGravatar Jie Fu 2 months
pr/4078Load a graph to the active top comonent if the active component has the graphGravatar Kochi Sakata 2 months
pr/3616remove -XX:TieredStopAtLevel=4Gravatar Yi Yang 2 months
pr/4077JDK-8267204: Expose access to underlying streams in DocletEnvironmentGravatar Jonathan Gibbons 2 months
pr/3806remove scratch register from vpmulldGravatar Xubo Zhang 2 months
pr/4075Use p_memsz instead of p_filesz to correctly compute segment size.Gravatar Chris Plummer 2 months
pr/4063aarch64Gravatar Albert Yang 2 months
pr/38458264777: Merge two try-with-resources blocks in testGravatar Brian Burkhalter 2 months
pr/40678224158: assertion related to NPE at DynamicCallSiteDesc::withArgs should be ...Gravatar Vicente Romero 2 months
pr/4081add allocator context and modify tests to match the changesGravatar Ivan Walulya 2 months
pr/40618264561: javap get NegativeArraySizeException on bad instructionGravatar Adam Sotona 2 months
pr/40598267166: Remove test file vmTestbase/vm/mlvm/tools/LoadClass.javaGravatar Harold Seigel 2 months
pr/40588267086: Fix ArrayIndexOutOfBoundsException in DerIndefLenConverterGravatar Fabian Meumertzheim 2 months
pr/40608266615: C2 incorrectly folds subtype checks involving an interface arrayGravatar Tobias Hartmann 2 months
pr/4056remove string dedup eventGravatar Albert Yang 2 months
pr/40558267212: test/jdk/java/util/Collections/FindSubList.java intermittent crash w...Gravatar Hui Shi 2 months
pr/4053Fixes convL2FSupported for aarch32Gravatar Christoph Göttschkes 2 months
pr/4051JDK-8267236: Versioned platform link in TestMemberSummary.javaGravatar Hannes Wallnoefer 2 months
pr/4052make ogl default on macOSGravatar aghaisas 2 months
pr/40548267119: switch expressions lack support for deferred type-checkingGravatar Jan Lahoda 2 months
pr/4050Merge branch 'master' into 8266897Gravatar Julia Boes 2 months
pr/4049JDK-8263438: Unused method AbstractMemberWriter.isInheritedGravatar Hannes Wallnoefer 2 months
pr/4047Whitespace fixesGravatar Aleksey Shipilev 2 months
pr/4057Improve relocation handlingGravatar Yasumasa Suenaga 2 months
pr/40468264290: Create implementation for NSAccessibilityComponentGroup protocol peerGravatar Alexander Zuev 2 months
pr/3689Tobias' reviewGravatar rwestrel 2 months
pr/40188267116: Lanai: Incorrect AlphaComposite for VolatileImage graphicsGravatar Alexey Ushakov 2 months
pr/4007ID2KlassTable* instead of ID2KlassTable *Gravatar Yi Yang 2 months
pr/4006Simplify API changes based on Gerard's suggestion.Gravatar David Holmes 2 months
pr/4042startGravatar tstuefe 2 months
pr/4038Update SunToolkit.javaGravatar mrserb 2 months
pr/3968zero shift for cds=on/dump on all platformsGravatar tstuefe 2 months
pr/3478plummercj CR - drop '::=' from the usage() output.Gravatar Daniel D. Daugherty 2 months
pr/4037JDK-8267187: Remove deprecated constructor for LogGravatar Jonathan Gibbons 2 months
pr/3709Use the final field "value" directly and remove value() method.Gravatar Valerie Peng 2 months
pr/4035Improve fold_compares c2 optimizationsGravatar Rahul Raghavan 2 months
pr/3953Fix indent in test TestDynamicDumpAtOom.javaGravatar Yumin Qi 2 months
pr/4033Add trailing newlineGravatar Maurizio Cimadamore 2 months
pr/4014Fix testsGravatar Vladimir Kozlov 2 months
pr/4004patch suggested by MaurizioGravatar Vicente Romero 2 months
pr/4022edited comment as per code review.Gravatar Sundararajan Athijegannathan 2 months
pr/4009Additional formatting cleanupGravatar Lance Andersen 2 months
pr/4031Problemlist test caseGravatar Thomas Schatzl 2 months
pr/3628Simplify thread_loop()Gravatar Ralf Schmelter 2 months
pr/3947merge and resolve conflict in arm.adGravatar Claes Redestad 2 months
pr/4026remove windows special handlingGravatar tstuefe 2 months
pr/4025remove typoGravatar tstuefe 2 months
pr/40238266962: Add arch supporting check for "Op_VectorLoadConst" before creating t...Gravatar Xiaohong Gong 2 months
pr/4024startGravatar tstuefe 2 months
pr/4048FixGravatar Prasanta Sadhukhan 2 months
pr/3992Merge branch 'master' into 8265605-bootloader-loadClassOrNull-before-init-phase2Gravatar iklam 2 months
pr/3662Merge branch 'master' into new_dedup2Gravatar Kim Barrett 3 months
pr/40218249395: (macos) jpackage tests timeout on MacPro5_1 systemsGravatar alexander_matveev 3 months
pr/40208267130: Memory Overflow in Disassembler::load_libraryGravatar Wanghuang-Huawei 3 months
pr/4017FixGravatar Vladimir Ivanov 3 months
pr/3920Change option and method nameGravatar Anton Kozlov 3 months
pr/4013fix testGravatar tstuefe 3 months
pr/3919Merge branch 'master' into 8265934Gravatar Patricio Chilano Mateo 3 months
pr/4012JDK-8267041: javac crash when creating lambda with capture inside a switch ex...Gravatar Jan Lahoda 3 months
pr/39038266622: Remove pointless String.substring() callGravatar Сергей Цыпанов 3 months
pr/3975Apply suggestions from code review Gravatar Thomas Schatzl 3 months
pr/3794Remove old ScrollAreaAccessibility from JavaComponentAccessibilityGravatar Pankaj Bansal 3 months
pr/3877Update after merge with masterGravatar David Holmes 3 months
pr/3990Merge branch 'master' into JDK-8264846Gravatar mrserb 3 months
pr/3995JFRGravatar Vladimir Ivanov 3 months
pr/40038266162: Remove JPackage duplicate testsGravatar Alexey Semenyuk 3 months
pr/4002ProblemList serviceability/sa/TestJmapCoreMetaspace.javaGravatar Chris Plummer 3 months
pr/4000Bump source levelGravatar Maurizio Cimadamore 3 months
pr/3972fix indentationGravatar Leo Korinth 3 months
pr/3958return true if stoppedGravatar Sandhya Viswanathan 3 months
pr/3998Renaming the test caseGravatar Naoto Sato 3 months
pr/3974test changes and small fixesGravatar Harold Seigel 3 months
pr/3865use the existing executable flag to indicate whether we want to commit exec m...Gravatar gerard ziemski 3 months
pr/39978263382: java/util/logging/ParentLoggersTest.java failed with "checkLoggers: ...Gravatar Daniel Fuchs 3 months
pr/3994JDK-8266651: Convert Table method parameters from String to ContentGravatar Hannes Wallnoefer 3 months
pr/3885Added missing full stopsGravatar pavelrappo 3 months
pr/3870Change to @implNote as per CSR notesGravatar Prasanta Sadhukhan 3 months
pr/3983declare has_old_class_version as a const methodGravatar Calvin Cheung 3 months
pr/39858266925: Add a test to verify that hidden class's members are not statically ...Gravatar Mandy Chung 3 months
pr/39848266783: java\lang\reflect\Proxy\DefaultMethods.java fails with jtreg 6Gravatar Mandy Chung 3 months
pr/3893update MD fileGravatar JoeWang-Java 3 months
pr/3982expose StackOverflow::_stack_overflow_limit to JVMCIGravatar Doug Simon 3 months
pr/3941Use the fixed indentation spaces in the format stringGravatar Jie Fu 3 months
pr/3921Add commentsGravatar Anton Kozlov 3 months
pr/1890Revise test code.Gravatar Guoxiong Li 3 months
pr/3856added thread stack comment in testGravatar Fernando Guallini 3 months
pr/39788266770: Clean pending exception before running dynamic CDS dumpGravatar Yumin Qi 3 months
pr/1934Clean the code.Gravatar Guoxiong Li 3 months
pr/3951Rename needs_clone_jvms -> needs_deep_clone_jvmsGravatar Tobias Hartmann 3 months
pr/3956Removed unnecessary assertGravatar Zhengyu Gu 3 months
pr/3964Merge remote-tracking branch 'refs/remotes/origin/remove-LowMemoryDetectorDis...Gravatar Hamlin-Li 3 months
pr/39868266904: Use function pointer typedefs in OopOopIterateDispatchGravatar Stefan Karlsson 3 months
pr/3900merge masterGravatar Albert Yang 3 months
pr/3965tchar() before id()Gravatar Yi Yang 3 months
pr/3970JDK-8266892Gravatar MBaesken 3 months
pr/39898231031: runtime/ReservedStack/ReservedStackTest.java fails after jsr166 refreshGravatar David Holmes 3 months
pr/39678266881: Enable debug log for SSLEngineExplorerMatchedSNI.javaGravatar Xuelei Fan 3 months
pr/39118266456: Replace direct TKit.run() calls with jdk.jpackage.test.Annotations.T...Gravatar alexander_matveev 3 months
pr/3939Recognizing also -Xrunjdwp: optionGravatar Jaroslav Tulach 3 months
pr/3966canonicalizer cleanupGravatar Yi Yang 3 months
pr/3963Merge branch 'openjdk:master' into remove-jvmtiGravatar Hamlin Li 3 months
pr/3962Merge branch 'openjdk:master' into remove-g1NUMAGravatar Hamlin Li 3 months
pr/3522Update copyrightGravatar Mitsuru Kariya 3 months
pr/39618266819: Separate the stop policies from the compile policies completelyGravatar Guoxiong Li 3 months
pr/39608266857: PipedOutputStream.sink should be volatileGravatar Liam Miller-Cushon 3 months
pr/39598266784: java/text/Collator/RuleBasedCollatorTest.java fails with jtreg 6Gravatar Naoto Sato 3 months
pr/3955Remove new line at end of file.Gravatar Cesar 3 months
pr/3923Removed obsolete commentsGravatar Daniel Fuchs 3 months
pr/3804library_call.cpp changes not needed after Objects.checkIndex arguments fixedGravatar Sandhya Viswanathan 3 months
pr/3945UseTransparentHugePages is only available on LinuxGravatar Aleksey Shipilev 3 months
pr/3952MergeGravatar Brian Burkhalter 3 months
pr/3946Merge branch 'master' into JDK-8266779Gravatar Hannes Wallnoefer 3 months
pr/3949JDK-8266808: Search label still uses old search field idGravatar Hannes Wallnoefer 3 months
pr/3950Add cht_reset methodGravatar Ivan Walulya 3 months
pr/3747fix test case problemGravatar Wanghuang-Huawei 3 months
pr/37988259316 added call to is_empty_method in compilerOracle.cpp so we now need to...Gravatar Claes Redestad 3 months
pr/39448266789: devirtualize find_node and remove of LinkedListGravatar Xin Liu 3 months
pr/39428266796: Clean up the unnecessary code in the method UnsharedNameTable#fromUtfGravatar Guoxiong Li 3 months
pr/3957Initial fixGravatar mrserb 3 months
pr/3913Update test per Coleen's comments:Gravatar David Holmes 3 months
pr/2420Fixing shift immediate constants handling.Gravatar Cesar 3 months
pr/3664Exclude duplicated operations in Cache.pull()Gravatar Alexey Bakhtin 3 months
pr/3936overflowGravatar Albert Yang 3 months
pr/3844Small fixesGravatar Alexander Zuev 3 months
pr/3902v2Gravatar Zhengyu Gu 3 months
pr/3948v1Gravatar Zhengyu Gu 3 months
pr/3935remove c1 IfInstanceOfGravatar Yi Yang 3 months
pr/39338266720: Wrong implementation in LibraryCallKit::inline_vector_shuffle_iotaGravatar Wanghuang-Huawei 3 months
pr/39318266774: System property values for stdout/err on Windows UTF-8Gravatar Naoto Sato 3 months
pr/39298250658: Performance of ClipFlatOval Renderperf test is very lowGravatar Alexey Ushakov 3 months
pr/39308266330: itableMethodEntry::initialize() asserts with archived old classesGravatar Calvin Cheung 3 months
pr/39328266765: [BACKOUT] JDK-8255493 Support for pre-generated java.lang.invoke cla...Gravatar Yumin Qi 3 months
pr/39288266765: [BACKOUT] JDK-8255493 Support for pre-generated java.lang.invoke cla...Gravatar Yumin Qi 3 months
pr/39278266489: Enable G1 to use large pages on Windows with region size large than 2mGravatar Stefan Johansson 3 months
pr/3894trailing whitespaces removedGravatar Alexey Semenyuk 3 months
pr/39248252530: Fix inconsistencies in hotspot whiteboxGravatar Philippe Marschall 3 months
pr/3922Merge branch 'master' into JDK-8266740-region-count-2Gravatar Zhengyu Gu 3 months
pr/3918chainGravatar Albert Yang 3 months
pr/3817JDK-8232644: Back out of signature cleanup conflicting with sealed classes ch...Gravatar Hannes Wallnoefer 3 months
pr/3874use iso8601_timestamp_size instead of 29Gravatar tstuefe 3 months
pr/3914fixed assigning -1 to uint64_tGravatar vyommani 3 months
pr/3915fix memory leakGravatar Ivan Walulya 3 months
pr/3908Remove tmpdirs member, call getTempDirectories() directly as needed.Gravatar Kevin Walls 3 months
pr/30078263583: Emoji rendering on macOSGravatar Dmitry Batrak 3 months
pr/3869remove stray editGravatar tstuefe 3 months
pr/3816MergeGravatar Alan Bateman 3 months
pr/3821address review commentsGravatar Jonathan Gibbons 3 months
pr/3912Update copyrightGravatar Guoxiong Li 3 months
pr/3853[zipfs] Add missing check-failed exception to position/read testGravatar Jason Zaugg 3 months
pr/39108266576: dynamicArchive/ParallelLambdaLoadTest.java crashes in tier2 testingGravatar Yumin Qi 3 months
pr/3905Test with new java.security fileGravatar Hai-May Chao 3 months
pr/3886Remove tab spaceGravatar Yumin Qi 3 months
pr/38908266589: Handle COPYFILE_ERR stage in fcopyfile_callback()Gravatar Brian Burkhalter 3 months
pr/3889added missed break; made all counters atomicGravatar Alex Menkov 3 months
pr/39078266645: javac should not check for sealed supertypes in intersection typesGravatar Vicente Romero 3 months
pr/3415Even simpler patchGravatar Aleksey Shipilev 3 months
pr/3904removed unused import statementGravatar Daniel Fuchs 3 months
pr/36878265426: changed order of equals check; refactored Identity.equals methodGravatar Patrick Concannon 3 months
pr/3899Optimize test case: DiagnosticSourceTestGravatar Guoxiong Li 3 months
pr/3822better commentGravatar Weijun Wang 3 months
pr/582Merge branch 'master' into minor-disambiguationGravatar Ignasi Marimon-Clos 3 months
pr/3838reviewGravatar Albert Yang 3 months
pr/38988266609: AArch64: include FP/LR space in LIR_Assembler::initial_frame_size_in...Gravatar Nick Gasson 3 months
pr/3897JDK-8266044: Nested class summary should show kind of class or interfaceGravatar Hannes Wallnoefer 3 months
pr/38968266618: Remove broken -XX:-OptoRemoveUselessGravatar Tobias Hartmann 3 months
pr/3873switch off warning in build instead of fixing itGravatar tstuefe 3 months
pr/3448Change variable name to better oneGravatar Kochi Sakata 3 months
pr/38108266193: BasicJMapTest does not include testHistoParallel methodsGravatar buddyliao 3 months
pr/3392fix commentsGravatar Wanghuang-Huawei 3 months
pr/3888Add additional permission required by TestNG 7.4Gravatar Lance Andersen 3 months
pr/3882Update testGravatar Harold Seigel 3 months
pr/3887Move the tag upwardsGravatar Aleksey Shipilev 3 months
pr/3884Minor cleanupsGravatar Claes Redestad 3 months
pr/2894Merge branch 'master' into JDK-8262992Gravatar Hannes Wallnoefer 3 months
pr/2912adjust absorbweight checkGravatar MBaesken 3 months
pr/3754JDK-8250766: Add missing null check and update copyright yearGravatar Hannes Wallnoefer 3 months
pr/38838252758: Lanai: Optimize index calculation while copying glyphsGravatar jayathirthrao 3 months
pr/3413JDK-8263507: More suggested code cleanupGravatar Hannes Wallnoefer 3 months
pr/3881Technical corrections to enhanced random numbers javadocGravatar JimLaskey 3 months
pr/2024Merge branch 'master' into JDK-8259316-blackholes-redoGravatar Aleksey Shipilev 3 months
pr/3879Misc cleanupsGravatar Vladimir Ivanov 3 months
pr/38768180568: Refactor javax/crypto shell tests to plain java testsGravatar Sibabrata Sahoo 3 months
pr/3851Move peer and getters to CFLayerGravatar jayathirthrao 3 months
pr/3871Forgot to remove }Gravatar Tobias Hartmann 3 months
pr/38728266528: Optimize C2 VerifyIterativeGVN execution timeGravatar kalinshi 3 months
pr/38688266531: ZAddress::address() should be removed from SAGravatar Yasumasa Suenaga 3 months
pr/3866remove trailing spaceGravatar Lance Andersen 3 months
pr/3864v1Gravatar Zhengyu Gu 3 months
pr/38628266519: Cleanup resolve() leftovers from BarrierSet et alGravatar Roman Kennke 3 months
pr/3611Remove unessential scope operatorGravatar Yumin Qi 3 months
pr/3859startGravatar tstuefe 3 months
pr/38588266505: Cleanup LibraryCallKit::make_unsafe_address()Gravatar Roman Kennke 3 months
pr/38578266504: Remove leftovers from BarrierSetAssemblerC1Gravatar Roman Kennke 3 months
pr/3855startGravatar tstuefe 3 months
pr/38608266499: AArch64: Delete dead code in aarch64.adGravatar theRealAph 3 months
pr/38618266498: Make debug ps() call print_stackGravatar Coleen Phillimore 3 months
pr/38528266497: Remove unnecessary EMCP liveness indicationGravatar Coleen Phillimore 3 months
pr/38788266349: Pass down requested page size to reserve_memory_specialGravatar Stefan Johansson 3 months
pr/3516Merge branch 'master' into 8265279Gravatar JimLaskey 3 months
pr/3582Align whitespaceGravatar Yasumasa Suenaga 3 months
pr/38508266491: Remove resolve and obj_equals leftovers from BarrierSetAssemblerGravatar Roman Kennke 3 months
pr/3849added comment. generics cleanup.Gravatar Sundararajan Athijegannathan 3 months
pr/3848Add missing includeGravatar David Holmes 3 months
pr/3706Restructure initializer, reuse AdapterSignatureIterator in create_native_wrap...Gravatar Claes Redestad 3 months
pr/38478266465: Add wildcard to JTwork/JTreport exclude in jib-profiles.jsGravatar David Holmes 3 months
pr/38468263124: Missed initialization of baselineY in sun.font.StrikeMetricsGravatar prrace 3 months
pr/38548262392: Update Mesa 3-D Headers to version 21.0.3Gravatar prrace 3 months
pr/38078266179: [macos] jpackage should specify architecture for produced pkg files ...Gravatar alexander_matveev 3 months
pr/3828fix whitespaceGravatar Mandy Chung 3 months
pr/3843v1Gravatar Zhengyu Gu 3 months
pr/3727Cover abstract method caseGravatar Vladimir Ivanov 3 months
pr/38428266436: Synthetic constructor trees have non-null return typeGravatar Jan Lahoda 3 months
pr/38418266449Gravatar iignatyev 3 months
pr/38408266438: Compile::remove_useless_nodes does not remove opaque nodesGravatar Tobias Hartmann 3 months
pr/3637Add temp node placement assertion.Gravatar Martin Doerr 3 months
pr/3811iwalulya: more renamingGravatar Thomas Schatzl 3 months
pr/3786wipGravatar tstuefe 3 months
pr/38398266432: ZGC: GC allocation stalls can trigger deadlocksGravatar Stefan Karlsson 3 months
pr/3837set opaque for JTooltip in config fileGravatar trebari 3 months
pr/3836startGravatar tstuefe 3 months
pr/3834startGravatar tstuefe 3 months
pr/37218265126: Review comments resolution.Gravatar Jatin Bhateja 3 months
pr/3809Undo changes to testsGravatar Philippe Marschall 3 months
pr/38328265291: Error in Javadoc for doAccessibleAction API in AccessibleJSlider classGravatar Pankaj Bansal 3 months
pr/3818Use PhaseIterGVN ptr as LoadNode::eliminate_autobox method parameter for simi...Gravatar Hui Shi 3 months
pr/3833Remove left-over itos entriesGravatar Claes Redestad 3 months
pr/38298266401: mark hotspot compiler/intrinsics/sha/cli tests which ignore VM flagsGravatar Jie Fu 3 months
pr/3751update copyright yearGravatar Wanghuang-Huawei 3 months
pr/3788Disable -Warray-bounds in makefileGravatar Yasumasa Suenaga 3 months
pr/3777Fixed a typo.Gravatar Naoto Sato 3 months
pr/3827JDK-8266129: tools/jpackage/windows/WinInstallerIconTest.java hangs with fast...Gravatar Andy Herrick 3 months
pr/38268261169: Upgrade HarfBuzz to the latest 2.8.0Gravatar prrace 3 months
pr/38238266388: C2: Improve ShiftCntV with a constant shift on x86Gravatar Vladimir Ivanov 3 months
pr/37198266013: Unexpected replacement character handling on stateful CharsetEncoderGravatar takiguc 3 months
pr/38208252237: C2: Call to compute_separating_interferences has wrong argument orderGravatar Rahul Raghavan 3 months
pr/3819JDK-8266227: Fix help text for --mac-signing-keychainGravatar Andy Herrick 3 months
pr/3815Review comments from DavidGravatar Per Liden 3 months
pr/38148265984: Concurrent GC: Some tests fail "assert(is_frame_safe(f)) failed: Fra...Gravatar Per Liden 3 months
pr/38138255227: java/net/httpclient/FlowAdapterPublisherTest.java intermittently fai...Gravatar Daniel Fuchs 3 months
pr/3762Fix typo threes -> treesGravatar Evgeny Nikitin 3 months
pr/38128255566: Initialize JDK_Version direct from the build systemGravatar David Holmes 3 months
pr/3808Update PLATFORM_API_MacOSX_MidiUtils.cGravatar serb 3 months
pr/3801Fix GHAGravatar Mikael Vidstedt 3 months
pr/3805FormattingGravatar Vladimir Ivanov 3 months
pr/38008266315: Problem list failing test java/awt/font/TextLayout/LigatureCaretTest...Gravatar prrace 3 months
pr/3764close stream carefullyGravatar Weijun Wang 3 months
pr/3802Use ReservedSpace.page_size() instead of actual_reserved_page_size()Gravatar Stefan Johansson 3 months
pr/3776Improved diagnostic messageGravatar Daniel Fuchs 3 months
pr/37578264395: WB_EnqueueInitializerForCompilation fails with "method holder must b...Gravatar Rahul Raghavan 3 months
pr/3653iwalulya review, removing try_claim_serial_task optimizationGravatar Thomas Schatzl 3 months
pr/3793assert root method not found in witnessed_reabstraction_in_supers is too strongGravatar jamsheed_c_m 3 months
pr/37928198616: java/awt/Focus/6378278/InputVerifierTest.java fails on macGravatar Prasanta Sadhukhan 3 months
pr/3663undo indentation changeGravatar Albert Yang 3 months
pr/2871Reflecting review comments.Gravatar Jan Lahoda 3 months
pr/3756reviewGravatar Albert Yang 3 months
pr/3977JDK-8266281: Assign Symbols to the package selector expressionGravatar Jan Lahoda 3 months
pr/37908266284: ProblemList java/awt/Graphics2D/DrawString/DrawRotatedStringUsingRot...Gravatar Prasanta Sadhukhan 3 months
pr/3791JDK-8249903: jdk/javadoc/doclet/testSerializedForm/TestSerializedForm.java ne...Gravatar Hannes Wallnoefer 3 months
pr/3658Update ArrayReferenceImpl.javaGravatar Fairoz Matte 3 months
pr/37898266172: -Wstringop-overflow happens in vmError.cppGravatar Yasumasa Suenaga 3 months
pr/37878266168: -Wmaybe-uninitialized happens in check_code.cGravatar Yasumasa Suenaga 3 months
pr/37848266267: Remove unnecessary jumps in Intel Math Library StubRoutinesGravatar Jie Fu 3 months
pr/37838266264Gravatar iignatyev 3 months
pr/3782copyright yearGravatar iignatyev 3 months
pr/3781use j.t.lib.Platform::is32bitGravatar iignatyev 3 months
pr/3755Add comments for why -0.0/0.0 are excludedGravatar Jie Fu 3 months
pr/37788266217: ZGC: Improve the -Xlog:gc+init output for NUMAGravatar Jie Fu 3 months
pr/37808262376: ReplaceCriticalClassesForSubgraphs.java fails if --with-build-jdk is...Gravatar iklam 3 months
pr/3732fixed type in otherThread variable nameGravatar Alex Menkov 3 months
pr/37758266255Gravatar iignatyev 3 months
pr/37748266251Gravatar iignatyev 3 months
pr/37738266231Gravatar iignatyev 3 months
pr/3581jatin-bhateja reviewGravatar Marcus G K Williams 3 months
pr/3772added oracle copyright lineGravatar iignatyev 3 months
pr/3795limitGravatar Albert Yang 3 months
pr/3770update copyright yearGravatar iignatyev 3 months
pr/37638265666: Enable AIX build platform to make external debug symbolsGravatar Andrew Leonard 3 months
pr/3769copyright yearGravatar iignatyev 3 months
pr/3734Removing redundant importsGravatar Ian Graves 3 months
pr/37718264472: Add a test group for running CDS tests with -XX:+VerifySharedSpacesGravatar Calvin Cheung 3 months
pr/3767split the testGravatar iignatyev 3 months
pr/3766Incomplete comment in build.tools.generatecharacter.GenerateCharacterGravatar Claes Redestad 3 months
pr/3765startGravatar tstuefe 3 months
pr/37258266078: Remove confusing commentGravatar Brian Burkhalter 3 months
pr/3468update @return descriptionGravatar Julia Boes 3 months
pr/3631Update copyright in test fontGravatar alexsch 3 months
pr/3744Update copyright yearGravatar Yasumasa Suenaga 3 months
pr/37608197821: Test java/awt/font/TextLayout/LigatureCaretTest.java fails on WindowsGravatar Prasanta Sadhukhan 3 months
pr/37598266206: Build failure after JDK-8264752 with older GCCsGravatar Aleksey Shipilev 3 months
pr/37588266040: Lanai: Incorrect calculations of clipping boundariesGravatar Alexey Ushakov 3 months
pr/3704Add pliden's refinementGravatar Jie Fu 3 months
pr/37538266170: -Wnonnull happens in classLoaderData.inline.hppGravatar Yasumasa Suenaga 3 months
pr/3752copyright yearGravatar iignatyev 3 months
pr/3490Typo error in comment section updatedGravatar Sibabrata Sahoo 3 months
pr/3749FixGravatar Prasanta Sadhukhan 3 months
pr/37508266185: Shenandoah: Fix incorrect comment/assertion messagesGravatar Yude Lin 3 months
pr/3748copyright yearGravatar iignatyev 3 months
pr/3746fixGravatar iignatyev 3 months
pr/3624Review CommentsGravatar Pankaj Bansal 3 months
pr/37458266180Gravatar iignatyev 3 months
pr/37438266174: -Wmisleading-indentation happens in libmlib_image sourcesGravatar Yasumasa Suenaga 3 months
pr/37428266173: -Wmaybe-uninitialized happens in jni_util.cGravatar Yasumasa Suenaga 3 months
pr/3740copyright yearGravatar iignatyev 3 months
pr/3741JDK-8265773: jdeps message jdk8internals indicating a non-existent JDK API is...Gravatar Mandy Chung 3 months
pr/3739update copyrightGravatar iignatyev 3 months
pr/3738update copyrightGravatar iignatyev 3 months
pr/37378266164Gravatar iignatyev 3 months
pr/3292Update copyright date and typo correctionGravatar Xuelei Fan 3 months
pr/3736update copyright yearGravatar iignatyev 3 months
pr/37688265918: java/io/Console/CharsetTest.java failed with "expect: spawn id exp6 ...Gravatar Naoto Sato 3 months
pr/37358266157: Problem list several awt jtreg tests that fail on macOS 11Gravatar prrace 3 months
pr/3711Updated comment and simplify code structure in one methodGravatar David Holmes 3 months
pr/3733update copyright yearGravatar iignatyev 3 months
pr/3731update copyrightGravatar iignatyev 3 months
pr/3730update copyrightGravatar iignatyev 3 months
pr/3729update copyrightGravatar iignatyev 3 months
pr/3726one more space before { missedGravatar iignatyev 3 months
pr/3722fix serviceability agentGravatar Patricio Chilano Mateo 3 months
pr/3702Revert code change about "constness".Gravatar Xin Liu 3 months
pr/3724updateGravatar Zhengyu Gu 3 months
pr/3718Require C2 for test executionGravatar Paul Sandoz 3 months
pr/36608264762: Remove dead code at X-Buffer:799Gravatar Brian Burkhalter 3 months
pr/37088266014: Clean up spurious line break in the testGravatar Brian Burkhalter 3 months
pr/3307Merge remote-tracking branch 'upstream/master' into debug_utilsGravatar Kevin Walls 3 months
pr/3357cleanup unused importGravatar aghaisas 3 months
pr/3387Merge branch 'master' into 8264873.cha.splitGravatar Vladimir Ivanov 3 months
pr/3695Merge branch 'master' into 8265932Gravatar Patricio Chilano Mateo 3 months
pr/3723add static castGravatar Aleksei Voitylov 3 months
pr/37178266055: ZGC: ZHeap::print_extended_on() doesn't disable deferred deleteGravatar Per Liden 3 months
pr/3678Update test/jdk/javax/swing/JComboBox/8033069/bug8033069NoScrollBar.java Gravatar Pankaj Bansal 3 months
pr/3677Add align attribute for 2.0Gravatar Jie Fu 3 months
pr/3469Remove unnecessary constructor.Gravatar JimLaskey 3 months
pr/3716JDK-8258602: JavaDoc field summary does not indicate final modifierGravatar Hannes Wallnoefer 3 months
pr/37148266038: Move newAddress() to JVMDebuggerGravatar Yasumasa Suenaga 3 months
pr/37138266027: The diamond finder does not find diamond candidates in field initial...Gravatar Jan Lahoda 3 months
pr/3684Use daemon thread and adjust timeoutGravatar Tobias Hartmann 3 months
pr/37128266028: C2 computes -0.0 for Math.pow(-0.0, 0.5)Gravatar Jie Fu 3 months
pr/1958updated according to comments on the CSRGravatar trebari 3 months
pr/3421Merge branch 'master' into JDK-8264806Gravatar Vladimir Kozlov 3 months
pr/37108266018: Shenandoah: fix an incorrect assertGravatar wattsun 3 months
pr/3707Initial fixGravatar serb 3 months
pr/3696Remove commented out friend class.Gravatar Coleen Phillimore 3 months
pr/3705Updating jdeps and jdeprscan to use Stream.toList()Gravatar Ian Graves 3 months
pr/3398Merge branch 'master' into JDK-8264805Gravatar Vladimir Kozlov 3 months
pr/3679reviewGravatar Albert Yang 3 months
pr/3698WhitespacesGravatar Vladimir Ivanov 3 months
pr/3685Remove mistakenly added fileGravatar Erik Gahlin 3 months
pr/3701JDK-8265995Gravatar Zhengyu Gu 3 months
pr/35838265445: Introduce the new client property for mac: apple.awt.windowAppearanceGravatar Alexey Ushakov 3 months
pr/3673Cleanup method JavacScope.equalsGravatar Guoxiong Li 3 months
pr/3674Refactor code styleGravatar Guoxiong Li 3 months
pr/3693ensure that system has enough disk space before buildingGravatar George Adams 3 months
pr/37008196415: Disable SHA-1 Signed JARsGravatar Sean Mullan 3 months
pr/3639use ASSERT_STREQGravatar Coleen Phillimore 3 months
pr/36918265967: Unused NullCheckNode forward declaration in node.hppGravatar Tobias Hartmann 3 months
pr/3453Add comment to macroGravatar Per Liden 3 months
pr/3633terminology refresh and move tests to a different locationGravatar Aleksei Voitylov 3 months
pr/3513add jmh test caseGravatar Wanghuang-Huawei 3 months
pr/3688Initial commitGravatar pavelrappo 3 months
pr/3671reviewGravatar Albert Yang 3 months
pr/36868196300: java/awt/TextArea/TextAreaScrolling/TextAreaScrolling.java times outGravatar Prasanta Sadhukhan 3 months
pr/3618Merge masterGravatar Prasanta Sadhukhan 3 months
pr/3681update copyrights.Gravatar Hamlin-Li 3 months
pr/3682copyrights update.Gravatar Hamlin-Li 3 months
pr/2379refine help message.Gravatar Hamlin-Li 3 months
pr/18808265474: Dubious 'null' assignment in CompactByteArray.expandGravatar Andrey Turbanov 3 months
pr/36768265915: adjust state_unloading_cycle compuation order in nmethod::is_unloadingGravatar miao zheng 3 months
pr/1915Fix typos in commentsGravatar Philippe Marschall 3 months
pr/3680JDK-8265394: G1: Improve assert in HeapRegion::reset_not_compacted_after_full_gcGravatar Hamlin-Li 3 months
pr/36758265901: Use pattern matching for instanceof at module jdk.compiler(part 3)Gravatar Guoxiong Li 3 months
pr/36728265911: assert(comp != __null) failed: Compiler instance missingGravatar Junji Wang 3 months
pr/2099Revert copyright.Gravatar Guoxiong Li 3 months
pr/3668Change 'linux-generic' -> 'linux-all'.Gravatar Daniel D. Daugherty 3 months
pr/3556Trailing space removedGravatar Tagir Valeev 3 months
pr/3612Replacing one additional Collections.toList() with an explicit toCollection()...Gravatar Ian Graves 3 months
pr/36658264663: Update serviceability/jvmti/SuspendWithCurrentThread/SuspendWithCurr...Gravatar lmesnik 3 months
pr/3692classesGravatar Albert Yang 3 months
pr/36518264317: Lanai: IncorrectUnmanagedImageRotatedClip.java fails on apple M1Gravatar Alexey Ushakov 3 months
pr/36598258625: [JVMCI] refactor and unify JVMCI readFieldValue pathGravatar Tom Rodriguez 3 months
pr/3650Removed redundant bracesGravatar Patrick Concannon 3 months
pr/3588Check for null before try blockGravatar Seán Coffey 3 months
pr/3654Refine description of Node::_igv_idxGravatar Roberto Castañeda Lozano 3 months
pr/1881Use meaningful class name and update copyrightGravatar Guoxiong Li 3 months
pr/3655JDK-8265613: False positives for "Related Packages"Gravatar Hannes Wallnoefer 3 months
pr/3570Thomas indent reviewGravatar Stefan Johansson 3 months
pr/36498198621: java/awt/Focus/KeyEventForBadFocusOwnerTest/KeyEventForBadFocusOwner...Gravatar Prasanta Sadhukhan 3 months
pr/3647startGravatar tstuefe 3 months
pr/3428Trailing whitespaces again.Gravatar Jesper Steen Møller 3 months
pr/3610Merge branch 'master' into 8265696-move-cds-sourcesGravatar iklam 3 months
pr/36458265816: Handle new VectorMaskCast node for x86Gravatar Sandhya Viswanathan 3 months
pr/3420Added more tests for checking IV values and interop test w/ SunJCEGravatar Valerie Peng 3 months
pr/3643Remove ProblemList-non-cds-modeGravatar M. Seledtsov 3 months
pr/3632Fix formattingGravatar Roman Kennke 3 months
pr/3640Merge branch 'master' into 8264196-link-and-cleanup-shared-classesGravatar Calvin Cheung 3 months
pr/36368265782: Bump bootjdk to jdk-17+19 on macosx-aarch64 at OracleGravatar Mikael Vidstedt 3 months
pr/3599Remove extra imports, fix nits to review commentsGravatar Yumin Qi 3 months
pr/3591removed set_jimage() and renamed JImage_File to JImage_fileGravatar Harold Seigel 3 months
pr/3419Revived charset() in JavaIOAccess interface.Gravatar Naoto Sato 3 months
pr/3576dholmes CR - delete unused N_THREADS.Gravatar Daniel D. Daugherty 3 months
pr/3548Merge branch 'master' into 8265327Gravatar Patricio Chilano Mateo 3 months
pr/36358264320: ShouldNotReachHere in Compile::print_inlining_move_to()Gravatar Vladimir Ivanov 3 months
pr/3648counterGravatar Albert Yang 3 months
pr/3634Lookup node in runningThreads list rather than assert.Gravatar Chris Plummer 3 months
pr/36308265757: stack-use-after-scope in perfMemory_posix.cpp get_user_name_slow()Gravatar Harold Seigel 3 months
pr/36258265689: JVMCI: InternalError: Class java.lang.Object does not implement inte...Gravatar Vladimir Ivanov 3 months
pr/36058265690: Use latest Ubuntu base image version in Docker testingGravatar Aleksey Shipilev 3 months
pr/36238197800: Test java/awt/Focus/NonFocusableWindowTest/NoEventsTest.java fails o...Gravatar Prasanta Sadhukhan 3 months
pr/3621apiGravatar Albert Yang 3 months
pr/3578added comment explaining box conversion of primitivesGravatar Doug Simon 3 months
pr/3622add linger-on-closeGravatar Fernando Guallini 3 months
pr/3715not_a_nodeGravatar Yi Yang 3 months
pr/3580Replace assert(false) with fatal()Gravatar David Holmes 3 months
pr/3609Add comment to #elseGravatar Per Liden 3 months
pr/3614fixGravatar Prasanta Sadhukhan 3 months
pr/3598fix indentation issueGravatar Lin Zang 3 months
pr/3629Converting to Stream.toList()Gravatar Ian Graves 3 months
pr/3577Tweaking wording and placementGravatar Ian Graves 3 months
pr/3606Remove modules clauseGravatar Alexander Zuev 3 months
pr/3479comment from @yminqi, add comment to the is_old_class(), add the @bug tag to ...Gravatar Calvin Cheung 3 months
pr/3608Include constructors.Gravatar Joe Darcy 3 months
pr/3426Updated the fix accordingly feedbackGravatar Alex Menkov 3 months
pr/36078265699: Revert change to compact() and add a commentGravatar Brian Burkhalter 3 months
pr/3595Revert find_callee_argument changesGravatar Claes Redestad 3 months
pr/3585Added commentGravatar Thomas Schatzl 3 months
pr/36048265490: Unterminated string passed to FindClass() in hotspot testGravatar Harold Seigel 3 months
pr/3603v1Gravatar Patricio Chilano Mateo 3 months
pr/1898Remove file Filter.javaGravatar Guoxiong Li 3 months
pr/2428MergeGravatar tstuefe 3 months
pr/36028168408: Test java/awt/Focus/ActualFocusedWindowTest/ActualFocusedWindowBlock...Gravatar Prasanta Sadhukhan 3 months
pr/3170Updated single letter pattern variable name in java/time/DurationGravatar Patrick Concannon 3 months
pr/3554Merge branch 'master' into 8265218.mh_loggingGravatar Vladimir Ivanov 3 months
pr/3542Just run with -XX:-PrintWarningsGravatar Aleksey Shipilev 3 months
pr/3191Merge branch 'master' into SuspendInHandshakeGravatar Robbin Ehn 3 months
pr/36018198422: Test java/awt/font/StyledMetrics/BoldSpace.java is unstableGravatar Prasanta Sadhukhan 3 months
pr/3537BigSur fixGravatar Prasanta Sadhukhan 3 months
pr/3600InitialGravatar Erik Gahlin 3 months
pr/3596missing semiGravatar Claes Redestad 3 months
pr/35978265591: Remove vestiages of intermediate JSR 175 annotation formatGravatar Joe Darcy 3 months
pr/3594JDK-8265483: All-caps “JAVA” in the top navigation barGravatar Jonathan Gibbons 3 months
pr/3564Merge branch 'master' into 8265411-avoid-unnecessary-method-init-intrinsic-idGravatar iklam 3 months
pr/35928264632: compiler/codecache/jmx/PoolsIndependenceTest.java fails to Notificat...Gravatar Evgeny Nikitin 3 months
pr/3590add macOS freetype install steps to docs/building.htmlGravatar George Adams 3 months
pr/3587Update AboutDialog.javaGravatar K Suman Rajkumaar 3 months
pr/3589Update g1ConcurrentMarkThread.cppGravatar Fairoz Matte 3 months
pr/3414none_compressed_class_pointers -> non_compressed_class_pointersGravatar Jie Fu 3 months
pr/3586startGravatar tstuefe 3 months
pr/3569Fix error message in testGravatar Thomas Schatzl 3 months
pr/3593Update headerGravatar Roberto Castañeda Lozano 3 months
pr/3568reviewGravatar Albert Yang 3 months
pr/3584ChangesGravatar Thomas Schatzl 3 months
pr/3561Replace '=' in jfrOptionsSet.cppGravatar Erik Gahlin 3 months
pr/3501Fork JVM 3 times in JMH test to smooth out variance in a particular forkGravatar Peter Levart 3 months
pr/35798265486: ProblemList javax/sound/midi/Sequencer/Recording.java on macosx-aarch64Gravatar Mikael Vidstedt 3 months
pr/3558updated date in copyrightGravatar Doug Simon 3 months
pr/35748265017: runtime/HiddenClasses/StressHiddenClasses.java timed out on Win* OCIGravatar Harold Seigel 3 months
pr/35738264569: Remove obsolete error messages from CDSTestUtils.javaGravatar Yumin Qi 3 months
pr/3404Optimize C2Gravatar Jie Fu 3 months
pr/3266proc path changedGravatar Weijun Wang 3 months
pr/3540Simplify listener registrationGravatar Roberto Castañeda Lozano 3 months
pr/3566Removes -Xmx2g for the first test case instance, which doesn't require a lot ...Gravatar Christoph Göttschkes 3 months
pr/3434Update src/hotspot/share/gc/g1/g1ConcurrentMark.hppGravatar Ivan Walulya 3 months
pr/3572Merge branch 'master' of github.com:openjdk/jdk into 8183374Gravatar Fernando Guallini 3 months
pr/3567initial changesGravatar trebari 3 months
pr/2004Merge branch 'master' into JDK-8231179Gravatar Guoxiong Li 3 months
pr/3530add include in macroAssembler_<cpu>.cppGravatar Yi Yang 3 months
pr/34498265105: gc/arguments/TestSelectDefaultGC.java fails when compiler1 is disabledGravatar sunguoyun 3 months
pr/35598252600: [JVMCI] remove mx configurationGravatar Doug Simon 3 months
pr/3562InitialGravatar Erik Gahlin 3 months
pr/35608265152: jpackage cleanup fails on Windows with IOException deleting msiGravatar Yasumasa Suenaga 3 months
pr/3565proxy-setGravatar Albert Yang 3 months
pr/2324 Merge branch 'master' into JDK-8200145Gravatar Guoxiong Li 3 months
pr/3563parse incomplete xmlGravatar Yi Yang 3 months
pr/2687MergeGravatar tstuefe 3 months
pr/3432Fix test fail on aarch64 when VM page is larger than 4KGravatar Hui Shi 3 months
pr/3536Revert TestPow0Dot5Opt.java changeGravatar Jie Fu 3 months
pr/35538265375: Bootcycle builds fail with StackOverflowError in cldrconverterGravatar Naoto Sato 3 months
pr/35468200559: Java agents doing instrumentation need a means to define auxiliary c...Gravatar Rafael Winterhalter 3 months
pr/3551Fix configure args for linux-x64Gravatar erikj 3 months
pr/3550JDK-8265371: Change to Visual Studio 2019 16.9.3 for building on Windows at O...Gravatar Erik Joelsson 3 months
pr/35498265370: ProblemList java/net/MulticastSocket/Promiscuous.java on macos-aarch64Gravatar Daniel D. Daugherty 3 months
pr/3363Inlining some single use variablesGravatar Ian Graves 3 months
pr/3547Merge branch 'master' into JDK-8265348-control-timed-waitGravatar Zhengyu Gu 3 months
pr/35458265343: Update Debian-based cross-compilation recipesGravatar Aleksey Shipilev 3 months
pr/34024511638: Double.toString(double) sometimes produces incorrect resultsGravatar Raffaello Giulietti 3 months
pr/35438265335: Epsilon: Minor typo in EpsilonElasticTLABDecay descriptionGravatar Aleksey Shipilev 3 months
pr/35418039270: The background color of the button can't be displayed and when press...Gravatar Alexander Zuev 3 months
pr/3539testGravatar rwestrel 3 months
pr/3538Fix commentGravatar Thomas Schatzl 3 months
pr/35358264372: Threads::destroy_vm only ever returns trueGravatar David Holmes 3 months
pr/35348265304 - make metal pipeline defaultGravatar aghaisas 3 months
pr/3555Update GHA configurationGravatar Mikael Vidstedt 3 months
pr/3514fix one more code path, assert; refine comments.Gravatar Hamlin-Li 3 months
pr/3463Update existing test based on review commentsGravatar jpai 3 months
pr/3238Merge jdk 'master' into JDK-8264104Gravatar Xiaohong Gong 3 months
pr/3529simplifyGravatar Yi Yang 3 months
pr/3507Merge branch 'master' into JDK-8265244Gravatar Wanghuang-Huawei 3 months
pr/35278265314: Obsolete the unused AssertOnSuspendWaitFailure and TraceSuspendWaitF...Gravatar David Holmes 3 months
pr/3474trailing whitespaceGravatar Aleksandr Zvegintsev 3 months
pr/3524Polish a commentGravatar Aleksey Shipilev 3 months
pr/34768265175: Transfer in 1MB chunks; fail with errno if sendfile() returns -1; no...Gravatar Brian Burkhalter 3 months
pr/35208265293: ProblemList java/foreign/TestDowncall.java on macosx-aarch64Gravatar Mikael Vidstedt 3 months
pr/3273Merge branch 'master' into JDK-8264373Gravatar Vicente Romero 3 months
pr/35198265062: Remove duplication constant MaxTextureSizeGravatar Denis Konoplev 3 months
pr/3518Fix the param nameGravatar Pankaj Bansal 3 months
pr/3494changed link from USDA to StandardProtocolFamily#UNIXGravatar Michael-Mc-Mahon 3 months
pr/3517Fixed ifdefGravatar Robbin Ehn 3 months
pr/3515Set group's parent when a group is added to the graph documentGravatar Roberto Castañeda Lozano 3 months
pr/3459Merge branch 'master' into fill-bots-in-full-gcGravatar Hamlin Li 3 months
pr/3523Improving order of Flag constants.Gravatar Jan Lahoda 3 months
pr/3512JDK-8265270: Type.getEnclosingType() may fail with CompletionFailureGravatar Jan Lahoda 3 months
pr/3511changes proposed by Thomas reviewGravatar Ivan Walulya 3 months
pr/3509Remove author tag and update test tagGravatar jayathirthrao 3 months
pr/3457Thomas review.Gravatar Stefan Johansson 3 months
pr/3456Copyright year fixGravatar Prasanta Sadhukhan 3 months
pr/3510Use glibc libm impl for dlog,dlog10,dexp iff 2.29 or greater on AArch64.Gravatar Greg Cawthorne 3 months
pr/3371code backupGravatar Eric Liu 3 months
pr/3531remove depcheck_<cpu>Gravatar Yi Yang 3 months
pr/35068265246: Fix macos-Aarch64 build after JDK-8263709Gravatar David Holmes 3 months
pr/1998Merge branch 'master' into JDK-8203925Gravatar Guoxiong Li 3 months
pr/35058263154: [macos] DMG builds have finder errorsGravatar alexander_matveev 3 months
pr/3503Fixed whitespaceGravatar David Holmes 3 months
pr/3496do not call internal methodGravatar Weijun Wang 3 months
pr/3472Add resolveOrNull for exploded MemberNameGravatar Claes Redestad 3 months
pr/35028258794: Support for CLDR version 39Gravatar Naoto Sato 3 months
pr/3493Fix the patch of output fileGravatar Jie Fu 3 months
pr/3504JDK-8265239Gravatar Zhengyu Gu 3 months
pr/35008265236: ProblemList java/foreign/TestUpcall.java on macosx-aarch64Gravatar Mikael Vidstedt 3 months
pr/34998265235: ProblemList java/foreign/TestIntrinsics.java on macosx-aarch64Gravatar Mikael Vidstedt 3 months
pr/34988265231: (fc) ReadDirect and WriteDirect tests fail after fix for JDK-8264821Gravatar Brian Burkhalter 3 months
pr/34848260255: C1: LoopInvariantCodeMotion constructor can leave some fields uninit...Gravatar Rickard Bäckman 3 months
pr/34978257804 Test runtime/modules/ModuleStress/ModuleStressGC.java fails: 'package...Gravatar Harold Seigel 3 months
pr/2737Removed extra assert and fixed extra Path usage in testGravatar Yumin Qi 3 months
pr/3495Check for null sourceGravatar JimLaskey 3 months
pr/34818265180: JvmtiCompiledMethodLoadEvent should include the stub section of nmet...Gravatar Tom Rodriguez 3 months
pr/3491Fixed SocketChannelGravatar Michael-Mc-Mahon 3 months
pr/34898263970: Manual test javax/swing/JTextField/JapaneseReadingAttributes/Japanes...Gravatar Prasanta Sadhukhan 3 months
pr/3259Update conditionsGravatar Yasumasa Suenaga 3 months
pr/3486Skip markingGravatar Thomas Schatzl 3 months
pr/3439Review comment: simplify testGravatar Jorn Vernee 3 months
pr/3406FixGravatar Prasanta Sadhukhan 3 months
pr/34888233565: [TESTBUG] NullModalityDialogTest.java fails on MacOSGravatar Prasanta Sadhukhan 3 months
pr/3471Add back individual security importsGravatar Lance Andersen 3 months
pr/34878265192: [macos_aarch64] configure script fails if GNU uname in PATHGravatar Nick Gasson 3 months
pr/3477Add links to discussion in java.lang.reflect package javadoc.Gravatar Joe Darcy 3 months
pr/3446Merge branch 'master' into 8265103-reduce-inclusion-oopMap.hppGravatar iklam 3 months
pr/34808265154: vinserti128 operand mix up for KNL platformsGravatar Sandhya Viswanathan 3 months
pr/34828264821: DirectIOTest fails on a system with large block sizeGravatar Brian Burkhalter 3 months
pr/3473JDK-8265078: jpackage tests on Windows leave large temp filesGravatar Andy Herrick 3 months
pr/34928265173: [test] divert spurious log output away from stream under test in Pro...Gravatar Roger Riggs 3 months
pr/34838265136: ZGC: Expose GarbageCollectorMXBeans for both pauses and cyclesGravatar Per Liden 3 months
pr/3377Use an event name in tests that is not a class nameGravatar Erik Gahlin 3 months
pr/3181more spec clarificationGravatar Weijun Wang 3 months
pr/3475fixed copyrightGravatar iklam 4 months
pr/34458265100: Make hashCode non-volatileGravatar Brian Burkhalter 4 months
pr/3532remove unused local varsGravatar Yi Yang 4 months
pr/34678265138: Simplify DerUtils::checkAlgGravatar Weijun Wang 4 months
pr/34658257836: Add additional test cases to TestSyncOnValueBasedClassEvent.javaGravatar Harold Seigel 4 months
pr/3466renamed constants fieldGravatar Fernando Guallini 4 months
pr/34648265075: Improve and simplify Class.resolveName()Gravatar Sergey Tsypanov 4 months
pr/34628265127: ZGC: Fix incorrect reporting of reclaimed memoryGravatar Per Liden 4 months
pr/3461Move NetBeans .form files to Java directoriesGravatar Roberto Castañeda Lozano 4 months
pr/3437Removed othervm argumentGravatar Conor Cleary 4 months
pr/34168048199: Cleaner syntak in getContextClassLoaderGravatar Conor Cleary 4 months
pr/34588265120: hs_err improvement: align the output of Virtual space metadata.Gravatar Junji Wang 4 months
pr/3485Initial commitGravatar Thomas Schatzl 4 months
pr/34558265116: ZGC: Steal local stacks instead of flushing themGravatar Per Liden 4 months
pr/3435Thomas review.Gravatar Stefan Johansson 4 months
pr/34548265113: ProblemList gtest/GTestWrapper.java:os.release_multi_mappings on mac...Gravatar Mikael Vidstedt 4 months
pr/34528265111: ProblemList java/util/concurrent/locks/Lock/TimedAcquireLeak.java on...Gravatar Mikael Vidstedt 4 months
pr/3447Return host CPU load directly from getCpuLoad()Gravatar Yasumasa Suenaga 4 months
pr/34518265112: ProblemList some java/foreign tests on macosx-aarch64Gravatar Mikael Vidstedt 4 months
pr/34508265110: ProblemList compiler/jvmci/jdk.vm.ci.code.test/src/jdk/vm/ci/code/te...Gravatar Mikael Vidstedt 4 months
pr/3410Remove array Type::dual_typeGravatar Xiaohong Gong 4 months
pr/3411adjust headersGravatar Wanghuang-Huawei 4 months
pr/3436Remove EXCEPTION_MARKGravatar Patricio Chilano Mateo 4 months
pr/3441TestApplet.java removedGravatar Aleksandr Zvegintsev 4 months
pr/3444Faster debug agent thread lookupsGravatar Chris Plummer 4 months
pr/34438263157: [macos]: java.library.path is being set incorrectlyGravatar alexander_matveev 4 months
pr/3258Merge branch 'master' into 8264224-macosx-aarch64Gravatar Mikael Vidstedt 4 months
pr/33548264200: Removed author tagGravatar Conor Cleary 4 months
pr/3433Remove switch in canBeCalledVirtualGravatar Claes Redestad 4 months
pr/3338Removed upstream licensed code from commitGravatar Alex Blewitt 4 months
pr/3073Merge branch 'master' into 8262291-one-special-allocGravatar Stefan Johansson 4 months
pr/3378Skip testing on 32-bit systemsGravatar Chris Hegarty 4 months
pr/34318265052: Break circular include dependency in objArrayOop.inline.hppGravatar Stefan Karlsson 4 months
pr/3323newlineGravatar Yi Yang 4 months
pr/34308233567: [TESTBUG] FocusSubRequestTest.java fails on macosGravatar Prasanta Sadhukhan 4 months
pr/3305FormattingGravatar Prasanta Sadhukhan 4 months
pr/34088264954: Incorporating closing comments.Gravatar Jatin Bhateja 4 months
pr/3417Remove unused imports and consistent line endingsGravatar Erik Gahlin 4 months
pr/30828263763: The constructor of an enumeration prefixes with two synthetic argume...Gravatar Rafael Winterhalter 4 months
pr/3429remove unused TypeFuncGravatar Yi Yang 4 months
pr/3318Merge branch 'master' into 8262328-templatize-jvmflag-boilerplate-methodsGravatar iklam 4 months
pr/3280Use resource controller name for unified loggingGravatar Yasumasa Suenaga 4 months
pr/3384Merge branch 'master' into 8264868-reduce-registerMap-hppGravatar iklam 4 months
pr/34258265005: Introduce the new client property for mac: apple.awt.windowTitleVisibleGravatar Alexey Ushakov 4 months
pr/34248265018: [AIX] FileDispatcherImpl.c:31:10: fatal error: 'sys/mount.h' file no...Gravatar Martin Doerr 4 months
pr/3405Change to use decode_error for incorrect extension lengthGravatar Xuelei Fan 4 months
pr/3418Missed fixing logging test.Gravatar Coleen Phillimore 4 months
pr/3423JDK-8265012Gravatar Zhengyu Gu 4 months
pr/3422Add W^X in FastGetXXXFieldGravatar Anton Kozlov 4 months
pr/3362Add overall comment and assert in count function.Gravatar Coleen Phillimore 4 months
pr/33908258788: incorrect response to change in window insets [lanai]Gravatar Alexey Ushakov 4 months
pr/27458260923: Add more tests for SSLSocket input/output shutdownGravatar akolarkunnu 4 months
pr/3303Complete projection assertions with basic checksGravatar Roberto Castañeda Lozano 4 months
pr/34098264976: Minor numeric bug in AbstractSplittableWithBrineGenerator.makeSplits...Gravatar Aleksey Shipilev 4 months
pr/3394Fix search&replace mistakeGravatar David Holmes 4 months
pr/3403Appease jcheckGravatar Joe Darcy 4 months
pr/2510Minor comment enhancementGravatar Martin Balao 4 months
pr/32798264400: Don't initialize hashCode; use Path.of() in testGravatar Brian Burkhalter 4 months
pr/34008264765: BreakIterator sees bogus sentence boundary in parenthesized “i.e....Gravatar Naoto Sato 4 months
pr/33668232861: Remove ENOTSUP fallback for fcntl(fd, F_FULLFSYNC) failureGravatar Brian Burkhalter 4 months
pr/3372ayang reviewGravatar Thomas Schatzl 4 months
pr/32518264484: Replace uses of StringBuffer with StringBuilder in jdk.hotspot.agentGravatar Andrey Turbanov 4 months
pr/3391update exception wordingsGravatar Weijun Wang 4 months
pr/33978264923: PNGImageWriter.write_zTXt throws Exception with a typoGravatar Aleksey Shipilev 4 months
pr/3396getVtableIndexForInterfaceMethodGravatar Vladimir Ivanov 4 months
pr/3346InstanceKlass::method_at_itable_or_null() cleanupsGravatar Vladimir Ivanov 4 months
pr/2760add sanity check; refine code in update_attribute_table.Gravatar Hamlin-Li 4 months
pr/33958264885: Fix the code style of macro in aarch64_neon_ad.m4Gravatar Wanghuang-Huawei 4 months
pr/3228reduce unnecessary memory write traffic in non-SIMD codeGravatar Dong Bo 4 months
pr/3382Respond to review feedback.Gravatar Joe Darcy 4 months
pr/3374Use stream apiGravatar Guoxiong Li 4 months
pr/3393remove memprofileGravatar Yi Yang 4 months
pr/3319remove e.getMessage()Gravatar denghui.ddh 4 months
pr/3281test update with commentGravatar Hai-May Chao 4 months
pr/33088258788: incorrect response to change in window insets [lanai]Gravatar Alexey Ushakov 4 months
pr/33888264623: Change to Xcode 12.4 for building on Macos at OracleGravatar Mikael Vidstedt 4 months
pr/3386CountingClassHierarchyIteratorGravatar Vladimir Ivanov 4 months
pr/3385KlassDepChange::involves_contextGravatar Vladimir Ivanov 4 months
pr/33898264874: Build interim-langtools for HotSpot only if Graal is enabledGravatar iklam 4 months
pr/2976This code is used for testing purpose and lock should be acquired with noGravatar Amit Pawar 4 months
pr/33688264143: Change uint8_t to unsigned charGravatar Denis Konoplev 4 months
pr/33768264779: Shortened parameter commentGravatar Conor Cleary 4 months
pr/3379Updated comment per request from erikj79Gravatar Lutz Schmidt 4 months
pr/3349Merge branch 'master' into 8214455-relocated-archived-regions-to-heap-topGravatar iklam 4 months
pr/33838261301: StringWriter.flush() is NOOP but documentation does not indicate itGravatar Brian Burkhalter 4 months
pr/3348Removed excess spacesGravatar Zhengyu Gu 4 months
pr/3032assign unmodHeaders instead of original headersGravatar Julia Boes 4 months
pr/3365Removed unneeded anymore code in match_fill_loop()Gravatar Vladimir Kozlov 4 months
pr/3375Add volatileGravatar Coleen Phillimore 4 months
pr/3345remove unneeded statementGravatar Harold Seigel 4 months
pr/3336fix typo in test descriptionGravatar Hui Shi 4 months
pr/3361Document how to build and run on a specific JDKGravatar Roberto Castañeda Lozano 4 months
pr/3355use same method to compute memory_size with global_buffer_sizeGravatar Hui Shi 4 months
pr/33708264352: AArch64: Optimize vector "not/andNot" for NEON and SVEGravatar Xiaohong Gong 4 months
pr/33698264318: DrawHugeImageTest.java fails on apple M1Gravatar Denis Konoplev 4 months
pr/33678264809: test-lib fails to build due to some warnings in ASN1Formatter and jfrGravatar Jie Fu 4 months
pr/3146javadoc changeGravatar Prasanta Sadhukhan 4 months
pr/3233Rename --disableregistry to --disable-registryGravatar Yasumasa Suenaga 4 months
pr/3347Fix AppImagePackageTest.testEmpty(true) failureGravatar Alexey Semenyuk 4 months
pr/3151Add a blank line to separate condition from bodyGravatar Alexey Ivanov 4 months
pr/3296use computeIfAbsent insteadGravatar Anthony Scarpino 4 months
pr/3359Remove bug numberGravatar JimLaskey 4 months
pr/3274Updated copyright year.Gravatar Mahendra Chhipa 4 months
pr/33608264797: Do not include klassVtable.hpp from instanceKlass.hppGravatar iklam 4 months
pr/3358Fix for testGravatar Michael-Mc-Mahon 4 months
pr/3356Bot fixes for 2760Gravatar Thomas Schatzl 4 months
pr/3286Update the commentGravatar Jie Fu 4 months
pr/3344CleanupsGravatar Vladimir Ivanov 4 months
pr/33538264759: x86_32 Minimal VM build failure after JDK-8262355Gravatar Aleksey Shipilev 4 months
pr/3270Specify Xcode version; don't use --extra-{c,cxx,ld}flagsGravatar Anton Kozlov 4 months
pr/33518264748: Do not include arguments.hpp from compilerDefinitions.hppGravatar iklam 4 months
pr/3350member variable _monitor of MonitorLocker is redundantGravatar Xin Liu 4 months
pr/3312Merge branch 'master' into 8264565-templatize-dcmd-num-argumentsGravatar iklam 4 months
pr/3343Include initial date.Gravatar JimLaskey 4 months
pr/3342Remove extraneous whitespace from phase timings reportGravatar William Kemper 4 months
pr/1292Merge branch 'master' into 8248862Gravatar JimLaskey 4 months
pr/3306Review comment: Rearrange code to explicitly reference erased setterGravatar Jorn Vernee 4 months
pr/3167set skin.laf as beforeGravatar trebari 4 months
pr/3341Adjust javadoc for ByteArray*StreamGravatar Sergey Tsypanov 4 months
pr/3320improve modularityGravatar Yi Yang 4 months
pr/33398264686: ClhsdbTestConnectArgument.java should use SATestUtils::validateSADeb...Gravatar Yasumasa Suenaga 4 months
pr/3340memprofiling_crashGravatar Yi Yang 4 months
pr/3337Additionally remove detritus from PNGImageDecoder.javaGravatar Alex Blewitt 4 months
pr/3265Fix commentsGravatar Hui Shi 4 months
pr/32238255800: Raster creation methods need some specification clean upGravatar prrace 4 months
pr/33328264512: jdk/test/jdk/java/util/prefs/ExportNode.java relies on default platf...Gravatar Brian Burkhalter 4 months
pr/33318264662: ProblemList vmTestbase/jit/escape/AdaptiveBlocking/AdaptiveBlocking0...Gravatar Daniel D. Daugherty 4 months
pr/3291Bumping copyright date.Gravatar Ian Graves 4 months
pr/3325Add both ways cross-compilationGravatar Anton Kozlov 4 months
pr/33308264658: ProblemList javax/swing/JInternalFrame/8146321/JInternalFrameIconTes...Gravatar Daniel D. Daugherty 4 months
pr/3201MergeGravatar Daniel Fuchs 4 months
pr/3327JDK-8264655: Minor internal doc comment cleanupGravatar Jonathan Gibbons 4 months
pr/3309SharedRegionAlignmentTest: removed timeout on test, removed is_alignment_loggedGravatar Yumin Qi 4 months
pr/33268264554: X509KeyManagerImpl calls getProtectionParameter with incorrect aliasGravatar Xuelei Fan 4 months
pr/3324Reinsert omitted assignmentGravatar Doug Lea 4 months
pr/33228264564: AArch64: use MOVI instead of FMOV to zero FP registerGravatar Nick Gasson 4 months
pr/33218264639: SA: Worker thread for ptrace on Linux should be more robustnessGravatar Yasumasa Suenaga 4 months
pr/3313typo correct of unmapable character in the comment lineGravatar Xuelei Fan 4 months
pr/3333delete "do{...} while (false);"Gravatar mrserb 4 months
pr/27688262355: Rebasing patch, 32bit clean-up.Gravatar Jatin Bhateja 4 months
pr/32908264539: Change poll timeout on macOS; use RandomFactoryGravatar Brian Burkhalter 4 months
pr/3317Appease jcheck.Gravatar Joe Darcy 4 months
pr/3316Remove update from compilerOracleGravatar Nils Eliasson 4 months
pr/3200fix THREADGravatar Coleen Phillimore 4 months
pr/3315c1: allow inlining of excluded methodsGravatar Nils Eliasson 4 months
pr/3314Update second method.Gravatar Joe Darcy 4 months
pr/33108262280: Incorrect exception handling for VMThread in class redefinitionGravatar Coleen Phillimore 4 months
pr/3213javadoc changeGravatar Prasanta Sadhukhan 4 months
pr/3254Merge branch 'master' into 8264285-clean-up-setting-ccstr-jvm-flagsGravatar iklam 4 months
pr/2752Lance's review - include tests for --extract long form optionGravatar jpai 4 months
pr/3283Refactor code to use drawTex2TexGravatar jayathirthrao 4 months
pr/3297Refactor ClassHierarchyWalker::is_witness()Gravatar Vladimir Ivanov 4 months
pr/3288Fix trailing whitespaceGravatar Andy Herrick 4 months
pr/2874Merge branch 'master' into JDK-8262981Gravatar Pankaj Bansal 4 months
pr/33048166727: javac crashed: [jimage.dll+0x1942] ImageStrings::find+0x28Gravatar JimLaskey 4 months
pr/33028264409: AArch64: generate better code for Vector API allTrueGravatar Ningsheng Jian 4 months
pr/3284Updated copyright dates.Gravatar Christoph Göttschkes 4 months
pr/3211Move the changing to AbstractMask.andNot and revert changes in VectorMaskGravatar Xiaohong Gong 4 months
pr/33008264544: Case-insensitive comparison issue with supplementary characters.Gravatar Naoto Sato 4 months
pr/32998264557: Incorrect copyright year for test/micro/org/openjdk/bench/java/lang/...Gravatar Jie Fu 4 months
pr/3364Add initializer to DatabaseRecord(DatabaseView& view)Gravatar Yasumasa Suenaga 4 months
pr/32988263448: CTW: fatal error: meet not symmetricGravatar Vladimir Kozlov 4 months
pr/2899Address lyndseyBeil, robehn and sspitsyn CR comments.Gravatar Daniel D. Daugherty 4 months
pr/3289Add and remove comments.Gravatar Coleen Phillimore 4 months
pr/32958264514: HexFormat implementation tweaksGravatar Raffaello Giulietti 4 months
pr/33818264514: HexFormat implementation tweaksGravatar Raffaello Giulietti 4 months
pr/3239Merge branch 'master' into JDK-8012229Gravatar mrserb 4 months
pr/32948169629: Annotations with lambda expressions cause AnnotationFormatErroGravatar Joe Darcy 4 months
pr/3256Corrected typoGravatar Sandhya Viswanathan 4 months
pr/3293Convert context_type from Klass* to InstanceKlass*Gravatar Vladimir Ivanov 4 months
pr/32758264484: Replace uses of StringBuffer with StringBuilder in jdk.hotspot.agentGravatar Andrey Turbanov 4 months
pr/3287Update the copyright yearGravatar Jie Fu 4 months
pr/33018262900: ToolBasicTest fails to access HTTP server it startsGravatar Jan Lahoda 4 months
pr/32858264513: Cleanup CardTableBarrierSetC2::post_barrierGravatar Aleksey Shipilev 4 months
pr/3263JDK-8264048: Remove old version of RemoveJar testGravatar Aleksei Efimov 4 months
pr/3282Review AlanGravatar Stefan Karlsson 4 months
pr/3218add max_retries count, move shell methods to ProcUtils and add win methodsGravatar Fernando Guallini 4 months
pr/3352rootGravatar Albert Yang 4 months
pr/3269Review KimGravatar Stefan Karlsson 4 months
pr/3261add new jtreg test with VerifySharedSpacesGravatar Yi Yang 4 months
pr/3272dholmes CR - fix nit in assert mesg.Gravatar Daniel D. Daugherty 4 months
pr/32778264150: CDS dumping code calls TRAPS functions in VM threadGravatar Coleen Phillimore 4 months
pr/3207Rename MethodCounter allocate functions, refactor null checking.Gravatar Coleen Phillimore 4 months
pr/3278InitialGravatar Erik Gahlin 4 months
pr/3187Add matching VM version string in outputGravatar Yumin Qi 4 months
pr/32768264466: Cut-paste error in InterfaceCalls JMHGravatar Eric Caspole 4 months
pr/3252Updated copyright datesGravatar Alex Blewitt 4 months
pr/2986Revise comments and move trailing padding.Gravatar Man Cao 4 months
pr/31838263898: Fix one more line breakGravatar Brian Burkhalter 4 months
pr/32718264311: Heap object statisticsGravatar Roman Kennke 4 months
pr/2841cleanup MacroAssembler::safepoint_pollGravatar Martin Doerr 4 months
pr/3267reordered fields and methodsGravatar Sebastian Stenzel 4 months
pr/3262Fix mark stack overflowGravatar casparcwang 4 months
pr/3260fillGravatar Albert Yang 4 months
pr/3264oopstorage bulk allocationGravatar Kim Barrett 4 months
pr/3224Get rid of dependency on the Random classGravatar Evgeny Nikitin 4 months
pr/3215Merge remote-tracking branch 'origin/master' into 8264271_avoid_creating_non_...Gravatar Stefan Karlsson 4 months
pr/3244annotated @bug for bug-idGravatar Yi Yang 4 months
pr/3042Add commentGravatar Yasumasa Suenaga 4 months
pr/3231update code styleGravatar Eric Liu 4 months
pr/2401trivial fixGravatar Wanghuang-Huawei 4 months
pr/32558264123.00.patchGravatar Daniel D. Daugherty 4 months
pr/3182Respond to review feedback.Gravatar Joe Darcy 4 months
pr/32538264397: Use the blessed modifier order in jdk.incubator.foreignGravatar Alex Blewitt 4 months
pr/3226Additional code style fixesGravatar Vladimir Kozlov 4 months
pr/32478264193: Remove TRAPS parameters for modules and defaultmethodsGravatar Harold Seigel 4 months
pr/3248JDK-8264279Gravatar Zhengyu Gu 4 months
pr/32498248418: jpackage fails to extract main class and version from app module lin...Gravatar Alexey Semenyuk 4 months
pr/32578264306: Non deterministic generation of java/lang/invoke/MemberName.classGravatar Jan Lahoda 4 months
pr/3245testGravatar rwestrel 4 months
pr/3246JDK-8264374Gravatar Zhengyu Gu 4 months
pr/3243Initial implementation, move cleanup printing to closuresGravatar Thomas Schatzl 4 months
pr/32428264358: Don't create invalid oop in method handle tracingGravatar Stefan Karlsson 4 months
pr/3241Switch W^X in DestroyJavaVM, DetachCurrentThreadGravatar Anton Kozlov 4 months
pr/3198Use OPENJDK_BUILD_CPU_BITS insteadGravatar Magnus Ihse Bursie 4 months
pr/3196cleaned up some spacesGravatar Lutz Schmidt 4 months
pr/3214Remove unused value_fn parameterGravatar Stefan Karlsson 4 months
pr/32408264344: Outdated links in JavaComponentAccessibility.mGravatar Alexander Zuev 4 months
pr/32378264333: Use the blessed modifier order in jdk.jshellGravatar Alex Blewitt 4 months
pr/32348264334: Use the blessed modifier order in jdk.jpackageGravatar Alex Blewitt 4 months
pr/32368264332: Use the blessed modifier order in jdk.charsetsGravatar Alex Blewitt 4 months
pr/32358264331: Use the blessed modifier order in jdk.compilerGravatar Alex Blewitt 4 months
pr/3229TidyGravatar Attila Szegedi 4 months
pr/32328264329: Z cannot be 1 for Diffie-Hellman key agreementGravatar Xuelei Fan 4 months
pr/3210Remove trailing whitespaceGravatar Tagir Valeev 4 months
pr/3230Update bug8072767.javaGravatar serb 4 months
pr/3227simplify reduce_deferred_updatesGravatar Kim Barrett 4 months
pr/3101restore not_suspended with default argumentGravatar Patricio Chilano Mateo 4 months
pr/3222Remove getSettings()Gravatar Erik Gahlin 4 months
pr/3203@iklam review commentGravatar Calvin Cheung 4 months
pr/32218264240: [macos_aarch64] enable appcds support after JDK-8263002Gravatar Vladimir Kempik 4 months
pr/3194Address dholmes's commentsGravatar Harold Seigel 4 months
pr/32198264285: Do not support FLAG_SET_XXX for VM flags of string typeGravatar iklam 4 months
pr/3217use tmp array, if buffer doesn't have an arrayGravatar Sebastian Stenzel 4 months
pr/2916Merge branch 'master' into JDK-8262958Gravatar Sebastian Stenzel 4 months
pr/3087Update copyrightGravatar Koichi Sakata 4 months
pr/3220Fixing compilation error.Gravatar Jan Lahoda 4 months
pr/32168264273: macOS: zero VM is broken due to no member named 'is_cpu_emulated' af...Gravatar Jie Fu 4 months
pr/3205Remove unused HexFormat instancesGravatar Roger Riggs 4 months
pr/32068262953: [TESTBUG] Test /runtime/containers/cgroup/PlainRead.java fails if CP...Gravatar Anton Ostrouhhov 4 months
pr/31898264161: ArithmeticException not declared for BigDecimal#stripTrailingZerosGravatar Fabian Meumertzheim 4 months
pr/2826Merge branch 'master' into bitwiseGravatar Sergey Tsypanov 5 months
pr/18528066694: Strange code in JavacParser.javaGravatar Andrey Turbanov 7 months
 
TagDownloadAuthorAge
jdk-18+7jdk-18+7.tar.gz  jdk-18+7.zip  Gravatar Jesper Wilhelmsson 7 days
jdk-17+32jdk-17+32.tar.gz  jdk-17+32.zip  Gravatar Jesper Wilhelmsson 7 days
jdk-18+6jdk-18+6.tar.gz  jdk-18+6.zip  Gravatar Jesper Wilhelmsson 2 weeks
jdk-17+31jdk-17+31.tar.gz  jdk-17+31.zip  Gravatar Jesper Wilhelmsson 2 weeks
jdk-18+5jdk-18+5.tar.gz  jdk-18+5.zip  Gravatar Jesper Wilhelmsson 3 weeks
jdk-17+30jdk-17+30.tar.gz  jdk-17+30.zip  Gravatar Jesper Wilhelmsson 3 weeks
jdk-17+29jdk-17+29.tar.gz  jdk-17+29.zip  Gravatar Jesper Wilhelmsson 4 weeks
jdk-18+4jdk-18+4.tar.gz  jdk-18+4.zip  Gravatar Jesper Wilhelmsson 4 weeks
jdk-18+3jdk-18+3.tar.gz  jdk-18+3.zip  Gravatar Jesper Wilhelmsson 5 weeks
jdk-17+28jdk-17+28.tar.gz  jdk-17+28.zip  Gravatar Jesper Wilhelmsson 5 weeks
jdk-17+27jdk-17+27.tar.gz  jdk-17+27.zip  Gravatar Jesper Wilhelmsson 6 weeks
jdk-18+2jdk-18+2.tar.gz  jdk-18+2.zip  Gravatar Jesper Wilhelmsson 6 weeks
jdk-18+1jdk-18+1.tar.gz  jdk-18+1.zip  Gravatar Jesper Wilhelmsson 7 weeks
jdk-17+26jdk-17+26.tar.gz  jdk-17+26.zip  Gravatar Jesper Wilhelmsson 7 weeks
jdk-18+0jdk-18+0.tar.gz  jdk-18+0.zip  Gravatar Jesper Wilhelmsson 7 weeks
jdk-17+25jdk-17+25.tar.gz  jdk-17+25.zip  Gravatar Jesper Wilhelmsson 8 weeks
jdk-17+24jdk-17+24.tar.gz  jdk-17+24.zip  Gravatar Jesper Wilhelmsson 2 months
jdk-17+23jdk-17+23.tar.gz  jdk-17+23.zip  Gravatar Jesper Wilhelmsson 2 months
jdk-17+22jdk-17+22.tar.gz  jdk-17+22.zip  Gravatar Jesper Wilhelmsson 3 months
jdk-17+21jdk-17+21.tar.gz  jdk-17+21.zip  Gravatar Jesper Wilhelmsson 3 months
jdk-17+20jdk-17+20.tar.gz  jdk-17+20.zip  Gravatar Jesper Wilhelmsson 3 months
jdk-17+19jdk-17+19.tar.gz  jdk-17+19.zip  Gravatar Jesper Wilhelmsson 3 months
jdk-17+18jdk-17+18.tar.gz  jdk-17+18.zip  Gravatar Jesper Wilhelmsson 3 months
jdk-17+17jdk-17+17.tar.gz  jdk-17+17.zip  Gravatar Jesper Wilhelmsson 4 months
jdk-17+16jdk-17+16.tar.gz  jdk-17+16.zip  Gravatar Jesper Wilhelmsson 4 months
jdk-17+15jdk-17+15.tar.gz  jdk-17+15.zip  Gravatar Jesper Wilhelmsson 4 months
jdk-17+14jdk-17+14.tar.gz  jdk-17+14.zip  Gravatar Jesper Wilhelmsson 4 months
jdk-16-gajdk-16-ga.tar.gz  jdk-16-ga.zip  Gravatar Jesper Wilhelmsson 4 months
jdk-17+13jdk-17+13.tar.gz  jdk-17+13.zip  Gravatar Jesper Wilhelmsson 5 months
jdk-17+12jdk-17+12.tar.gz  jdk-17+12.zip  Gravatar Jesper Wilhelmsson 5 months
jdk-17+11jdk-17+11.tar.gz  jdk-17+11.zip  Gravatar Jesper Wilhelmsson 5 months
jdk-17+10jdk-17+10.tar.gz  jdk-17+10.zip  Gravatar Jesper Wilhelmsson 5 months
jdk-17+9jdk-17+9.tar.gz  jdk-17+9.zip  Gravatar Jesper Wilhelmsson 6 months
jdk-16+36jdk-16+36.tar.gz  jdk-16+36.zip  Gravatar Jesper Wilhelmsson 6 months
jdk-16+35jdk-16+35.tar.gz  jdk-16+35.zip  Gravatar Jesper Wilhelmsson 6 months
jdk-17+8jdk-17+8.tar.gz  jdk-17+8.zip  Gravatar Jesper Wilhelmsson 6 months
jdk-17+7jdk-17+7.tar.gz  jdk-17+7.zip  Gravatar Jesper Wilhelmsson 6 months
jdk-16+34jdk-16+34.tar.gz  jdk-16+34.zip  Gravatar Jesper Wilhelmsson 6 months
jdk-16+33jdk-16+33.tar.gz  jdk-16+33.zip  Gravatar Jesper Wilhelmsson 6 months
jdk-17+6jdk-17+6.tar.gz  jdk-17+6.zip  Gravatar Jesper Wilhelmsson 6 months
jdk-17+5jdk-17+5.tar.gz  jdk-17+5.zip  Gravatar Jesper Wilhelmsson 6 months
jdk-16+32jdk-16+32.tar.gz  jdk-16+32.zip  Gravatar Jesper Wilhelmsson 6 months
jdk-17+4jdk-17+4.tar.gz  jdk-17+4.zip  Gravatar Jesper Wilhelmsson 7 months
jdk-16+31jdk-16+31.tar.gz  jdk-16+31.zip  Gravatar Jesper Wilhelmsson 7 months
jdk-17+3jdk-17+3.tar.gz  jdk-17+3.zip  Gravatar Jesper Wilhelmsson 7 months
jdk-16+30jdk-16+30.tar.gz  jdk-16+30.zip  Gravatar Jesper Wilhelmsson 7 months
jdk-16+29jdk-16+29.tar.gz  jdk-16+29.zip  Gravatar Jesper Wilhelmsson 7 months
jdk-17+2jdk-17+2.tar.gz  jdk-17+2.zip  Gravatar Jesper Wilhelmsson 7 months
jdk-17+1jdk-17+1.tar.gz  jdk-17+1.zip  Gravatar Jesper Wilhelmsson 8 months
jdk-16+28jdk-16+28.tar.gz  jdk-16+28.zip  Gravatar Jesper Wilhelmsson 8 months
jdk-17+0jdk-17+0.tar.gz  jdk-17+0.zip  Gravatar Jesper Wilhelmsson 8 months
jdk-16+27jdk-16+27.tar.gz  jdk-16+27.zip  Gravatar Jesper Wilhelmsson 8 months
jdk-16+26jdk-16+26.tar.gz  jdk-16+26.zip  Gravatar Jesper Wilhelmsson 8 months
jdk-16+25jdk-16+25.tar.gz  jdk-16+25.zip  Gravatar Jesper Wilhelmsson 8 months
jdk-16+24jdk-16+24.tar.gz  jdk-16+24.zip  Gravatar Jesper Wilhelmsson 9 months
jdk-16+23jdk-16+23.tar.gz  jdk-16+23.zip  Gravatar Jesper Wilhelmsson 9 months
jdk-16+22jdk-16+22.tar.gz  jdk-16+22.zip  Gravatar Jesper Wilhelmsson 9 months
jdk-16+21jdk-16+21.tar.gz  jdk-16+21.zip  Gravatar Jesper Wilhelmsson 9 months
jdk-16+20jdk-16+20.tar.gz  jdk-16+20.zip  Gravatar Jesper Wilhelmsson 9 months
jdk-16+19jdk-16+19.tar.gz  jdk-16+19.zip  Gravatar Jesper Wilhelmsson 10 months
jdk-15-gajdk-15-ga.tar.gz  jdk-15-ga.zip  Gravatar Jesper Wilhelmsson 10 months
jdk-16+18jdk-16+18.tar.gz  jdk-16+18.zip  Gravatar Jesper Wilhelmsson 10 months
jdk-16+17jdk-16+17.tar.gz  jdk-16+17.zip  Gravatar Jesper Wilhelmsson 10 months
jdk-16+16jdk-16+16.tar.gz  jdk-16+16.zip  Gravatar Jesper Wilhelmsson 10 months
jdk-16+15jdk-16+15.tar.gz  jdk-16+15.zip  Gravatar Jesper Wilhelmsson 11 months
jdk-16+14jdk-16+14.tar.gz  jdk-16+14.zip  Gravatar Jesper Wilhelmsson 11 months
jdk-16+13jdk-16+13.tar.gz  jdk-16+13.zip  Gravatar Jesper Wilhelmsson 11 months
jdk-16+12jdk-16+12.tar.gz  jdk-16+12.zip  Gravatar Jesper Wilhelmsson 11 months
jdk-16+11jdk-16+11.tar.gz  jdk-16+11.zip  Gravatar Mikael Vidstedt 12 months
jdk-15+36jdk-15+36.tar.gz  jdk-15+36.zip  Gravatar Mikael Vidstedt 12 months
jdk-16+10jdk-16+10.tar.gz  jdk-16+10.zip  Gravatar Mikael Vidstedt 12 months
jdk-16+9jdk-16+9.tar.gz  jdk-16+9.zip  Gravatar Mikael Vidstedt 12 months
jdk-15+35jdk-15+35.tar.gz  jdk-15+35.zip  Gravatar Mikael Vidstedt 12 months
jdk-16+8jdk-16+8.tar.gz  jdk-16+8.zip  Gravatar Mikael Vidstedt 12 months
jdk-15+34jdk-15+34.tar.gz  jdk-15+34.zip  Gravatar Mikael Vidstedt 12 months
jdk-16+7jdk-16+7.tar.gz  jdk-16+7.zip  Gravatar Mikael Vidstedt 12 months
jdk-15+33jdk-15+33.tar.gz  jdk-15+33.zip  Gravatar Mikael Vidstedt 12 months
jdk-16+6jdk-16+6.tar.gz  jdk-16+6.zip  Gravatar Mikael Vidstedt 12 months
jdk-15+32jdk-15+32.tar.gz  jdk-15+32.zip  Gravatar Mikael Vidstedt 12 months
jdk-16+5jdk-16+5.tar.gz  jdk-16+5.zip  Gravatar Jesper Wilhelmsson 13 months
jdk-15+31jdk-15+31.tar.gz  jdk-15+31.zip  Gravatar Jesper Wilhelmsson 13 months
jdk-16+4jdk-16+4.tar.gz  jdk-16+4.zip  Gravatar Jesper Wilhelmsson 13 months
jdk-15+30jdk-15+30.tar.gz  jdk-15+30.zip  Gravatar Jesper Wilhelmsson 13 months
jdk-16+3jdk-16+3.tar.gz  jdk-16+3.zip  Gravatar Jesper Wilhelmsson 13 months
jdk-15+29jdk-15+29.tar.gz  jdk-15+29.zip  Gravatar Jesper Wilhelmsson 13 months
jdk-15+28jdk-15+28.tar.gz  jdk-15+28.zip  Gravatar Jesper Wilhelmsson 13 months
jdk-16+2jdk-16+2.tar.gz  jdk-16+2.zip  Gravatar Jesper Wilhelmsson 13 months
jdk-16+1jdk-16+1.tar.gz  jdk-16+1.zip  Gravatar Jesper Wilhelmsson 14 months
jdk-15+27jdk-15+27.tar.gz  jdk-15+27.zip  Gravatar Jesper Wilhelmsson 14 months
jdk-16+0jdk-16+0.tar.gz  jdk-16+0.zip  Gravatar Jesper Wilhelmsson 14 months
jdk-15+26jdk-15+26.tar.gz  jdk-15+26.zip  Gravatar Jesper Wilhelmsson 14 months
jdk-15+25jdk-15+25.tar.gz  jdk-15+25.zip  Gravatar Jesper Wilhelmsson 14 months
jdk-15+24jdk-15+24.tar.gz  jdk-15+24.zip  Gravatar Jesper Wilhelmsson 14 months
jdk-15+23jdk-15+23.tar.gz  jdk-15+23.zip  Gravatar Jesper Wilhelmsson 15 months
jdk-15+22jdk-15+22.tar.gz  jdk-15+22.zip  Gravatar Jesper Wilhelmsson 15 months
jdk-15+21jdk-15+21.tar.gz  jdk-15+21.zip  Gravatar Jesper Wilhelmsson 15 months
jdk-15+20jdk-15+20.tar.gz  jdk-15+20.zip  Gravatar Jesper Wilhelmsson 15 months
jdk-15+19jdk-15+19.tar.gz  jdk-15+19.zip  Gravatar Jesper Wilhelmsson 15 months
jdk-15+18jdk-15+18.tar.gz  jdk-15+18.zip  Gravatar Jesper Wilhelmsson 16 months
jdk-15+17jdk-15+17.tar.gz  jdk-15+17.zip  Gravatar Jesper Wilhelmsson 16 months
jdk-15+16jdk-15+16.tar.gz  jdk-15+16.zip  Gravatar Jesper Wilhelmsson 16 months
jdk-15+15jdk-15+15.tar.gz  jdk-15+15.zip  Gravatar Jesper Wilhelmsson 16 months
jdk-14-gajdk-14-ga.tar.gz  jdk-14-ga.zip  Gravatar Jesper Wilhelmsson 16 months
jdk-15+14jdk-15+14.tar.gz  jdk-15+14.zip  Gravatar Jesper Wilhelmsson 17 months
jdk-15+13jdk-15+13.tar.gz  jdk-15+13.zip  Gravatar Jesper Wilhelmsson 17 months
jdk-15+12jdk-15+12.tar.gz  jdk-15+12.zip  Gravatar Jesper Wilhelmsson 17 months
jdk-15+11jdk-15+11.tar.gz  jdk-15+11.zip  Gravatar Jesper Wilhelmsson 17 months
jdk-15+10jdk-15+10.tar.gz  jdk-15+10.zip  Gravatar Jesper Wilhelmsson 17 months
jdk-14+36jdk-14+36.tar.gz  jdk-14+36.zip  Gravatar Jesper Wilhelmsson 18 months
jdk-15+9jdk-15+9.tar.gz  jdk-15+9.zip  Gravatar Jesper Wilhelmsson 18 months
jdk-14+35jdk-14+35.tar.gz  jdk-14+35.zip  Gravatar Jesper Wilhelmsson 18 months
jdk-15+8jdk-15+8.tar.gz  jdk-15+8.zip  Gravatar Jesper Wilhelmsson 18 months
jdk-14+34jdk-14+34.tar.gz  jdk-14+34.zip  Gravatar Jesper Wilhelmsson 18 months
jdk-15+7jdk-15+7.tar.gz  jdk-15+7.zip  Gravatar Jesper Wilhelmsson 18 months
jdk-14+33jdk-14+33.tar.gz  jdk-14+33.zip  Gravatar Jesper Wilhelmsson 18 months
jdk-15+6jdk-15+6.tar.gz  jdk-15+6.zip  Gravatar Jesper Wilhelmsson 18 months
jdk-14+32jdk-14+32.tar.gz  jdk-14+32.zip  Gravatar Jesper Wilhelmsson 18 months
jdk-14+31jdk-14+31.tar.gz  jdk-14+31.zip  Gravatar Jesper Wilhelmsson 19 months
jdk-15+5jdk-15+5.tar.gz  jdk-15+5.zip  Gravatar Jesper Wilhelmsson 19 months
jdk-15+4jdk-15+4.tar.gz  jdk-15+4.zip  Gravatar Jesper Wilhelmsson 19 months
jdk-14+30jdk-14+30.tar.gz  jdk-14+30.zip  Gravatar Jesper Wilhelmsson 19 months
jdk-14+29jdk-14+29.tar.gz  jdk-14+29.zip  Gravatar Jesper Wilhelmsson 19 months
jdk-15+3jdk-15+3.tar.gz  jdk-15+3.zip  Gravatar Jesper Wilhelmsson 19 months
jdk-15+2jdk-15+2.tar.gz  jdk-15+2.zip  Gravatar Jesper Wilhelmsson 19 months
jdk-14+28jdk-14+28.tar.gz  jdk-14+28.zip  Gravatar Jesper Wilhelmsson 19 months
jdk-15+1jdk-15+1.tar.gz  jdk-15+1.zip  Gravatar Jesper Wilhelmsson 20 months
jdk-14+27jdk-14+27.tar.gz  jdk-14+27.zip  Gravatar Jesper Wilhelmsson 20 months
jdk-15+0jdk-15+0.tar.gz  jdk-15+0.zip  Gravatar Jesper Wilhelmsson 20 months
jdk-14+26jdk-14+26.tar.gz  jdk-14+26.zip  Gravatar Jesper Wilhelmsson 20 months
jdk-14+25jdk-14+25.tar.gz  jdk-14+25.zip  Gravatar Jesper Wilhelmsson 20 months
jdk-14+24jdk-14+24.tar.gz  jdk-14+24.zip  Gravatar Jesper Wilhelmsson 20 months
jdk-14+23jdk-14+23.tar.gz  jdk-14+23.zip  Gravatar Jesper Wilhelmsson 20 months
jdk-14+22jdk-14+22.tar.gz  jdk-14+22.zip  Gravatar Jesper Wilhelmsson 21 months
jdk-14+21jdk-14+21.tar.gz  jdk-14+21.zip  Gravatar Jesper Wilhelmsson 21 months
jdk-14+20jdk-14+20.tar.gz  jdk-14+20.zip  Gravatar Jesper Wilhelmsson 21 months
jdk-14+19jdk-14+19.tar.gz  jdk-14+19.zip  Gravatar Jesper Wilhelmsson 21 months
jdk-14+18jdk-14+18.tar.gz  jdk-14+18.zip  Gravatar Jesper Wilhelmsson 22 months
jdk-14+17jdk-14+17.tar.gz  jdk-14+17.zip  Gravatar Jesper Wilhelmsson 22 months
jdk-14+16jdk-14+16.tar.gz  jdk-14+16.zip  Gravatar Jesper Wilhelmsson 22 months
jdk-14+15jdk-14+15.tar.gz  jdk-14+15.zip  Gravatar Jesper Wilhelmsson 22 months
jdk-14+14jdk-14+14.tar.gz  jdk-14+14.zip  Gravatar Jesper Wilhelmsson 23 months
jdk-13-gajdk-13-ga.tar.gz  jdk-13-ga.zip  Gravatar Jesper Wilhelmsson 23 months
jdk-14+13jdk-14+13.tar.gz  jdk-14+13.zip  Gravatar Jesper Wilhelmsson 23 months
jdk-14+12jdk-14+12.tar.gz  jdk-14+12.zip  Gravatar Jesper Wilhelmsson 23 months
jdk-14+11jdk-14+11.tar.gz  jdk-14+11.zip  Gravatar Jesper Wilhelmsson 23 months
jdk-14+10jdk-14+10.tar.gz  jdk-14+10.zip  Gravatar Jesper Wilhelmsson 23 months
jdk-13+33jdk-13+33.tar.gz  jdk-13+33.zip  Gravatar Jesper Wilhelmsson 24 months
jdk-14+9jdk-14+9.tar.gz  jdk-14+9.zip  Gravatar Jesper Wilhelmsson 24 months
jdk-14+8jdk-14+8.tar.gz  jdk-14+8.zip  Gravatar Mikael Vidstedt 24 months
jdk-13+32jdk-13+32.tar.gz  jdk-13+32.zip  Gravatar Mikael Vidstedt 24 months
jdk-14+7jdk-14+7.tar.gz  jdk-14+7.zip  Gravatar Mikael Vidstedt 2 years
jdk-13+31jdk-13+31.tar.gz  jdk-13+31.zip  Gravatar Mikael Vidstedt 2 years
jdk-14+6jdk-14+6.tar.gz  jdk-14+6.zip  Gravatar Mikael Vidstedt 2 years
jdk-13+30jdk-13+30.tar.gz  jdk-13+30.zip  Gravatar Mikael Vidstedt 2 years
jdk-13+29jdk-13+29.tar.gz  jdk-13+29.zip  Gravatar Mikael Vidstedt 2 years
jdk-14+5jdk-14+5.tar.gz  jdk-14+5.zip  Gravatar Mikael Vidstedt 2 years
jdk-14+4jdk-14+4.tar.gz  jdk-14+4.zip  Gravatar Mikael Vidstedt 2 years
jdk-13+28jdk-13+28.tar.gz  jdk-13+28.zip  Gravatar Mikael Vidstedt 2 years
jdk-13+27jdk-13+27.tar.gz  jdk-13+27.zip  Gravatar Jesper Wilhelmsson 2 years
jdk-14+3jdk-14+3.tar.gz  jdk-14+3.zip  Gravatar Jesper Wilhelmsson 2 years
jdk-14+2jdk-14+2.tar.gz  jdk-14+2.zip  Gravatar Jesper Wilhelmsson 2 years
jdk-13+26jdk-13+26.tar.gz  jdk-13+26.zip  Gravatar Jesper Wilhelmsson 2 years
jdk-13+25jdk-13+25.tar.gz  jdk-13+25.zip  Gravatar Jesper Wilhelmsson 2 years
jdk-14+1jdk-14+1.tar.gz  jdk-14+1.zip  Gravatar Jesper Wilhelmsson 2 years
jdk-14+0jdk-14+0.tar.gz  jdk-14+0.zip  Gravatar Jesper Wilhelmsson 2 years
jdk-13+24jdk-13+24.tar.gz  jdk-13+24.zip  Gravatar Jesper Wilhelmsson 2 years
jdk-13+23jdk-13+23.tar.gz  jdk-13+23.zip  Gravatar Jesper Wilhelmsson 2 years
jdk-13+22jdk-13+22.tar.gz  jdk-13+22.zip  Gravatar Jesper Wilhelmsson 2 years
jdk-13+21jdk-13+21.tar.gz  jdk-13+21.zip  Gravatar Jesper Wilhelmsson 2 years
jdk-13+20jdk-13+20.tar.gz  jdk-13+20.zip  Gravatar Jesper Wilhelmsson 2 years
jdk-13+19jdk-13+19.tar.gz  jdk-13+19.zip  Gravatar Jesper Wilhelmsson 2 years
jdk-13+18jdk-13+18.tar.gz  jdk-13+18.zip  Gravatar Jesper Wilhelmsson 2 years
jdk-13+17jdk-13+17.tar.gz  jdk-13+17.zip  Gravatar Jesper Wilhelmsson 2 years
jdk-13+16jdk-13+16.tar.gz  jdk-13+16.zip  Gravatar Jesper Wilhelmsson 2 years
jdk-13+15jdk-13+15.tar.gz  jdk-13+15.zip  Gravatar Jesper Wilhelmsson 2 years
jdk-13+14jdk-13+14.tar.gz  jdk-13+14.zip  Gravatar Jesper Wilhelmsson 2 years
jdk-13+13jdk-13+13.tar.gz  jdk-13+13.zip  Gravatar Jesper Wilhelmsson 2 years
jdk-12-gajdk-12-ga.tar.gz  jdk-12-ga.zip  Gravatar Jesper Wilhelmsson 2 years
jdk-13+12jdk-13+12.tar.gz  jdk-13+12.zip  Gravatar Jesper Wilhelmsson 2 years
jdk-13+11jdk-13+11.tar.gz  jdk-13+11.zip  Gravatar Jesper Wilhelmsson 2 years
jdk-13+10jdk-13+10.tar.gz  jdk-13+10.zip  Gravatar Jesper Wilhelmsson 2 years
jdk-13+9jdk-13+9.tar.gz  jdk-13+9.zip  Gravatar Jesper Wilhelmsson 2 years
jdk-12+33jdk-12+33.tar.gz  jdk-12+33.zip  Gravatar Jesper Wilhelmsson 2 years
jdk-13+8jdk-13+8.tar.gz  jdk-13+8.zip  Gravatar Jesper Wilhelmsson 2 years
jdk-12+32jdk-12+32.tar.gz  jdk-12+32.zip  Gravatar Jesper Wilhelmsson 2 years
jdk-12+31jdk-12+31.tar.gz  jdk-12+31.zip  Gravatar Jesper Wilhelmsson 2 years
jdk-13+7jdk-13+7.tar.gz  jdk-13+7.zip  Gravatar Jesper Wilhelmsson 2 years
jdk-13+6jdk-13+6.tar.gz  jdk-13+6.zip  Gravatar Jesper Wilhelmsson 2 years
jdk-12+30jdk-12+30.tar.gz  jdk-12+30.zip  Gravatar Jesper Wilhelmsson 2 years
jdk-13+5jdk-13+5.tar.gz  jdk-13+5.zip  Gravatar Jesper Wilhelmsson 3 years
jdk-12+29jdk-12+29.tar.gz  jdk-12+29.zip  Gravatar Jesper Wilhelmsson 3 years
jdk-12+28jdk-12+28.tar.gz  jdk-12+28.zip  Gravatar Jesper Wilhelmsson 3 years
jdk-13+4jdk-13+4.tar.gz  jdk-13+4.zip  Gravatar Jesper Wilhelmsson 3 years
jdk-13+3jdk-13+3.tar.gz  jdk-13+3.zip  Gravatar Jesper Wilhelmsson 3 years
jdk-12+27jdk-12+27.tar.gz  jdk-12+27.zip  Gravatar Jesper Wilhelmsson 3 years
jdk-13+2jdk-13+2.tar.gz  jdk-13+2.zip  Gravatar Jesper Wilhelmsson 3 years
jdk-12+26jdk-12+26.tar.gz  jdk-12+26.zip  Gravatar Jesper Wilhelmsson 3 years
jdk-12+25jdk-12+25.tar.gz  jdk-12+25.zip  Gravatar Jesper Wilhelmsson 3 years
jdk-13+1jdk-13+1.tar.gz  jdk-13+1.zip  Gravatar Jesper Wilhelmsson 3 years
jdk-12+24jdk-12+24.tar.gz  jdk-12+24.zip  Gravatar Jesper Wilhelmsson 3 years
jdk-13+0jdk-13+0.tar.gz  jdk-13+0.zip  Gravatar Jesper Wilhelmsson 3 years
jdk-12+23jdk-12+23.tar.gz  jdk-12+23.zip  Gravatar Jesper Wilhelmsson 3 years
jdk-12+22jdk-12+22.tar.gz  jdk-12+22.zip  Gravatar Jesper Wilhelmsson 3 years
jdk-12+21jdk-12+21.tar.gz  jdk-12+21.zip  Gravatar Jesper Wilhelmsson 3 years
jdk-12+20jdk-12+20.tar.gz  jdk-12+20.zip  Gravatar Jesper Wilhelmsson 3 years
jdk-12+19jdk-12+19.tar.gz  jdk-12+19.zip  Gravatar Jesper Wilhelmsson 3 years
jdk-12+18jdk-12+18.tar.gz  jdk-12+18.zip  Gravatar Jesper Wilhelmsson 3 years
jdk-12+17jdk-12+17.tar.gz  jdk-12+17.zip  Gravatar Jesper Wilhelmsson 3 years
jdk-12+16jdk-12+16.tar.gz  jdk-12+16.zip  Gravatar Jesper Wilhelmsson 3 years
jdk-12+15jdk-12+15.tar.gz  jdk-12+15.zip  Gravatar Jesper Wilhelmsson 3 years
jdk-12+14jdk-12+14.tar.gz  jdk-12+14.zip  Gravatar Jesper Wilhelmsson 3 years
jdk-12+13jdk-12+13.tar.gz  jdk-12+13.zip  Gravatar Jesper Wilhelmsson 3 years
jdk-12+12jdk-12+12.tar.gz  jdk-12+12.zip  Gravatar Jesper Wilhelmsson 3 years
jdk-12+11jdk-12+11.tar.gz  jdk-12+11.zip  Gravatar Jesper Wilhelmsson 3 years
jdk-12+10jdk-12+10.tar.gz  jdk-12+10.zip  Gravatar Jesper Wilhelmsson 3 years
jdk-12+9jdk-12+9.tar.gz  jdk-12+9.zip  Gravatar Jesper Wilhelmsson 3 years
jdk-11+28jdk-11+28.tar.gz  jdk-11+28.zip  Gravatar Jesper Wilhelmsson 3 years
jdk-12+8jdk-12+8.tar.gz  jdk-12+8.zip  Gravatar Jesper Wilhelmsson 3 years
jdk-12+7jdk-12+7.tar.gz  jdk-12+7.zip  Gravatar Mikael Vidstedt 3 years
jdk-11+27jdk-11+27.tar.gz  jdk-11+27.zip  Gravatar Mikael Vidstedt 3 years
jdk-12+6jdk-12+6.tar.gz  jdk-12+6.zip  Gravatar Mikael Vidstedt 3 years
jdk-11+26jdk-11+26.tar.gz  jdk-11+26.zip  Gravatar Mikael Vidstedt 3 years
jdk-12+5jdk-12+5.tar.gz  jdk-12+5.zip  Gravatar Phil Race 3 years
jdk-11+25jdk-11+25.tar.gz  jdk-11+25.zip  Gravatar Phil Race 3 years
jdk-12+4jdk-12+4.tar.gz  jdk-12+4.zip  Gravatar Phil Race 3 years
jdk-11+24jdk-11+24.tar.gz  jdk-11+24.zip  Gravatar Phil Race 3 years
jdk-12+3jdk-12+3.tar.gz  jdk-12+3.zip  Gravatar Phil Race 3 years
jdk-11+23jdk-11+23.tar.gz  jdk-11+23.zip  Gravatar Phil Race 3 years
jdk-11+22jdk-11+22.tar.gz  jdk-11+22.zip  Gravatar Jesper Wilhelmsson 3 years
jdk-12+2jdk-12+2.tar.gz  jdk-12+2.zip  Gravatar Jesper Wilhelmsson 3 years
jdk-12+1jdk-12+1.tar.gz  jdk-12+1.zip  Gravatar Jesper Wilhelmsson 3 years
jdk-11+21jdk-11+21.tar.gz  jdk-11+21.zip  Gravatar Jesper Wilhelmsson 3 years
jdk-11+20jdk-11+20.tar.gz  jdk-11+20.zip  Gravatar Jesper Wilhelmsson 3 years
jdk-12+0jdk-12+0.tar.gz  jdk-12+0.zip  Gravatar Jesper Wilhelmsson 3 years
jdk-11+19jdk-11+19.tar.gz  jdk-11+19.zip  Gravatar Jesper Wilhelmsson 3 years
jdk-11+18jdk-11+18.tar.gz  jdk-11+18.zip  Gravatar Jesper Wilhelmsson 3 years
jdk-11+17jdk-11+17.tar.gz  jdk-11+17.zip  Gravatar Jesper Wilhelmsson 3 years
jdk-11+16jdk-11+16.tar.gz  jdk-11+16.zip  Gravatar Jesper Wilhelmsson 3 years
jdk-11+15jdk-11+15.tar.gz  jdk-11+15.zip  Gravatar Jesper Wilhelmsson 3 years
jdk-11+14jdk-11+14.tar.gz  jdk-11+14.zip  Gravatar Abhijit Saha 3 years
jdk-11+13jdk-11+13.tar.gz  jdk-11+13.zip  Gravatar Lana Steuck 3 years
jdk-11+12jdk-11+12.tar.gz  jdk-11+12.zip  Gravatar Lana Steuck 3 years
jdk-11+11jdk-11+11.tar.gz  jdk-11+11.zip  Gravatar Lana Steuck 3 years
jdk-11+10jdk-11+10.tar.gz  jdk-11+10.zip  Gravatar Lana Steuck 3 years
jdk-11+9jdk-11+9.tar.gz  jdk-11+9.zip  Gravatar Lana Steuck 3 years
jdk-11+8jdk-11+8.tar.gz  jdk-11+8.zip  Gravatar Lana Steuck 3 years
jdk-11+7jdk-11+7.tar.gz  jdk-11+7.zip  Gravatar Lana Steuck 3 years
jdk-11+6jdk-11+6.tar.gz  jdk-11+6.zip  Gravatar Lana Steuck 3 years
jdk-11+5jdk-11+5.tar.gz  jdk-11+5.zip  Gravatar Lana Steuck 3 years
jdk-11+4jdk-11+4.tar.gz  jdk-11+4.zip  Gravatar Lana Steuck 3 years
jdk-10+46jdk-10+46.tar.gz  jdk-10+46.zip  Gravatar Lana Steuck 3 years
jdk-11+3jdk-11+3.tar.gz  jdk-11+3.zip  Gravatar Lana Steuck 3 years
jdk-10+45jdk-10+45.tar.gz  jdk-10+45.zip  Gravatar Lana Steuck 3 years
jdk-11+2jdk-11+2.tar.gz  jdk-11+2.zip  Gravatar Lana Steuck 3 years
jdk-10+44jdk-10+44.tar.gz  jdk-10+44.zip  Gravatar Lana Steuck 3 years
jdk-11+1jdk-11+1.tar.gz  jdk-11+1.zip  Gravatar Lana Steuck 3 years
jdk-10+43jdk-10+43.tar.gz  jdk-10+43.zip  Gravatar Lana Steuck 3 years
jdk-10+42jdk-10+42.tar.gz  jdk-10+42.zip  Gravatar Lana Steuck 3 years
jdk-10+41jdk-10+41.tar.gz  jdk-10+41.zip  Gravatar Lana Steuck 4 years
jdk-10+40jdk-10+40.tar.gz  jdk-10+40.zip  Gravatar Lana Steuck 4 years
jdk-10+39jdk-10+39.tar.gz  jdk-10+39.zip  Gravatar Lana Steuck 4 years
jdk-10+38jdk-10+38.tar.gz  jdk-10+38.zip  Gravatar Lana Steuck 4 years
jdk-10+37jdk-10+37.tar.gz  jdk-10+37.zip  Gravatar Lana Steuck 4 years
jdk-10+36jdk-10+36.tar.gz  jdk-10+36.zip  Gravatar Lana Steuck 4 years
jdk-11+0jdk-11+0.tar.gz  jdk-11+0.zip  Gravatar Lana Steuck 4 years
jdk-10+35jdk-10+35.tar.gz  jdk-10+35.zip  Gravatar Lana Steuck 4 years
jdk-10+34jdk-10+34.tar.gz  jdk-10+34.zip  Gravatar Lana Steuck 4 years
jdk-10+33jdk-10+33.tar.gz  jdk-10+33.zip  Gravatar Lana Steuck 4 years
jdk-10+32jdk-10+32.tar.gz  jdk-10+32.zip  Gravatar Lana Steuck 4 years
jdk-10+31jdk-10+31.tar.gz  jdk-10+31.zip  Gravatar Lana Steuck 4 years
jdk-10+30jdk-10+30.tar.gz  jdk-10+30.zip  Gravatar Lana Steuck 4 years
jdk-10+29jdk-10+29.tar.gz  jdk-10+29.zip  Gravatar Lana Steuck 4 years
jdk-10+28jdk-10+28.tar.gz  jdk-10+28.zip  Gravatar Lana Steuck 4 years
jdk-10+27jdk-10+27.tar.gz  jdk-10+27.zip  Gravatar Lana Steuck 4 years
jdk-10+26jdk-10+26.tar.gz  jdk-10+26.zip  Gravatar Lana Steuck 4 years
jdk-10+25jdk-10+25.tar.gz  jdk-10+25.zip  Gravatar Lana Steuck 4 years
jdk-10+24jdk-10+24.tar.gz  jdk-10+24.zip  Gravatar Lana Steuck 4 years
jdk-10+23jdk-10+23.tar.gz  jdk-10+23.zip  Gravatar J. Duke 4 years
jdk-10+22jdk-10+22.tar.gz  jdk-10+22.zip  Gravatar J. Duke 4 years
jdk-10+21jdk-10+21.tar.gz  jdk-10+21.zip  Gravatar J. Duke 4 years
jdk-10+20jdk-10+20.tar.gz  jdk-10+20.zip  Gravatar J. Duke 4 years
jdk-9+181jdk-9+181.tar.gz  jdk-9+181.zip  Gravatar J. Duke 4 years
jdk-10+19jdk-10+19.tar.gz  jdk-10+19.zip  Gravatar J. Duke 4 years
jdk-10+18jdk-10+18.tar.gz  jdk-10+18.zip  Gravatar J. Duke 4 years
jdk-9+180jdk-9+180.tar.gz  jdk-9+180.zip  Gravatar J. Duke 4 years
jdk-9+179jdk-9+179.tar.gz  jdk-9+179.zip  Gravatar J. Duke 4 years
jdk-10+17jdk-10+17.tar.gz  jdk-10+17.zip  Gravatar J. Duke 4 years
jdk-10+16jdk-10+16.tar.gz  jdk-10+16.zip  Gravatar J. Duke 4 years
jdk-10+15jdk-10+15.tar.gz  jdk-10+15.zip  Gravatar J. Duke 4 years
jdk-9+178jdk-9+178.tar.gz  jdk-9+178.zip  Gravatar J. Duke 4 years
jdk-9+177jdk-9+177.tar.gz  jdk-9+177.zip  Gravatar J. Duke 4 years
jdk-9+176jdk-9+176.tar.gz  jdk-9+176.zip  Gravatar J. Duke 4 years
jdk-10+14jdk-10+14.tar.gz  jdk-10+14.zip  Gravatar J. Duke 4 years
jdk-9+175jdk-9+175.tar.gz  jdk-9+175.zip  Gravatar J. Duke 4 years
jdk-10+13jdk-10+13.tar.gz  jdk-10+13.zip  Gravatar J. Duke 4 years
jdk-9+174jdk-9+174.tar.gz  jdk-9+174.zip  Gravatar J. Duke 4 years
jdk-10+12jdk-10+12.tar.gz  jdk-10+12.zip  Gravatar J. Duke 4 years
jdk-9+173jdk-9+173.tar.gz  jdk-9+173.zip  Gravatar J. Duke 4 years
jdk-10+11jdk-10+11.tar.gz  jdk-10+11.zip  Gravatar J. Duke 4 years
jdk-9+172jdk-9+172.tar.gz  jdk-9+172.zip  Gravatar J. Duke 4 years
jdk-10+10jdk-10+10.tar.gz  jdk-10+10.zip  Gravatar J. Duke 4 years
jdk-9+171jdk-9+171.tar.gz  jdk-9+171.zip  Gravatar J. Duke 4 years
jdk-10+9jdk-10+9.tar.gz  jdk-10+9.zip  Gravatar J. Duke 4 years
jdk-9+170jdk-9+170.tar.gz  jdk-9+170.zip  Gravatar J. Duke 4 years
jdk-10+8jdk-10+8.tar.gz  jdk-10+8.zip  Gravatar J. Duke 4 years
jdk-9+169jdk-9+169.tar.gz  jdk-9+169.zip  Gravatar J. Duke 4 years
jdk-10+7jdk-10+7.tar.gz  jdk-10+7.zip  Gravatar J. Duke 4 years
jdk-9+168jdk-9+168.tar.gz  jdk-9+168.zip  Gravatar J. Duke 4 years
jdk-9+167jdk-9+167.tar.gz  jdk-9+167.zip  Gravatar J. Duke 4 years
jdk-10+6jdk-10+6.tar.gz  jdk-10+6.zip  Gravatar J. Duke 4 years
jdk-9+166jdk-9+166.tar.gz  jdk-9+166.zip  Gravatar J. Duke 4 years
jdk-10+5jdk-10+5.tar.gz  jdk-10+5.zip  Gravatar J. Duke 4 years
jdk-9+165jdk-9+165.tar.gz  jdk-9+165.zip  Gravatar J. Duke 4 years
jdk-10+4jdk-10+4.tar.gz  jdk-10+4.zip  Gravatar J. Duke 4 years
jdk-9+164jdk-9+164.tar.gz  jdk-9+164.zip  Gravatar J. Duke 4 years
jdk-9+163jdk-9+163.tar.gz  jdk-9+163.zip  Gravatar J. Duke 4 years
jdk-9+162jdk-9+162.tar.gz  jdk-9+162.zip  Gravatar J. Duke 4 years
jdk-10+3jdk-10+3.tar.gz  jdk-10+3.zip  Gravatar J. Duke 4 years
jdk-9+161jdk-9+161.tar.gz  jdk-9+161.zip  Gravatar J. Duke 4 years
jdk-9+160jdk-9+160.tar.gz  jdk-9+160.zip  Gravatar J. Duke 4 years
jdk-9+159jdk-9+159.tar.gz  jdk-9+159.zip  Gravatar J. Duke 4 years
jdk-10+2jdk-10+2.tar.gz  jdk-10+2.zip  Gravatar J. Duke 4 years
jdk-9+158jdk-9+158.tar.gz  jdk-9+158.zip  Gravatar J. Duke 4 years
jdk-9+157jdk-9+157.tar.gz  jdk-9+157.zip  Gravatar J. Duke 4 years
jdk-10+1jdk-10+1.tar.gz  jdk-10+1.zip  Gravatar J. Duke 4 years
jdk-9+156jdk-9+156.tar.gz  jdk-9+156.zip  Gravatar J. Duke 4 years
jdk-9+155jdk-9+155.tar.gz  jdk-9+155.zip  Gravatar J. Duke 4 years
jdk-9+154jdk-9+154.tar.gz  jdk-9+154.zip  Gravatar J. Duke 4 years
jdk-10+0jdk-10+0.tar.gz  jdk-10+0.zip  Gravatar J. Duke 4 years
jdk-9+153jdk-9+153.tar.gz  jdk-9+153.zip  Gravatar J. Duke 4 years
jdk-9+152jdk-9+152.tar.gz  jdk-9+152.zip  Gravatar J. Duke 4 years
jdk-9+151jdk-9+151.tar.gz  jdk-9+151.zip  Gravatar J. Duke 4 years
jdk-9+150jdk-9+150.tar.gz  jdk-9+150.zip  Gravatar J. Duke 4 years
jdk-9+149jdk-9+149.tar.gz  jdk-9+149.zip  Gravatar J. Duke 4 years
jdk-9+148jdk-9+148.tar.gz  jdk-9+148.zip  Gravatar J. Duke 4 years
jdk-9+147jdk-9+147.tar.gz  jdk-9+147.zip  Gravatar J. Duke 4 years
jdk-9+146jdk-9+146.tar.gz  jdk-9+146.zip  Gravatar J. Duke 4 years
jdk-9+145jdk-9+145.tar.gz  jdk-9+145.zip  Gravatar J. Duke 4 years
jdk-9+144jdk-9+144.tar.gz  jdk-9+144.zip  Gravatar J. Duke 4 years
jdk-9+143jdk-9+143.tar.gz  jdk-9+143.zip  Gravatar J. Duke 4 years
jdk-9+142jdk-9+142.tar.gz  jdk-9+142.zip  Gravatar J. Duke 4 years
jdk-9+141jdk-9+141.tar.gz  jdk-9+141.zip  Gravatar J. Duke 4 years
jdk-9+140jdk-9+140.tar.gz  jdk-9+140.zip  Gravatar J. Duke 4 years
jdk-9+139jdk-9+139.tar.gz  jdk-9+139.zip  Gravatar J. Duke 4 years
jdk-9+138jdk-9+138.tar.gz  jdk-9+138.zip  Gravatar J. Duke 4 years
jdk-9+137jdk-9+137.tar.gz  jdk-9+137.zip  Gravatar J. Duke 4 years
jdk-9+136jdk-9+136.tar.gz  jdk-9+136.zip  Gravatar J. Duke 4 years
jdk-9+135jdk-9+135.tar.gz  jdk-9+135.zip  Gravatar J. Duke 4 years
jdk-9+134jdk-9+134.tar.gz  jdk-9+134.zip  Gravatar J. Duke 4 years
jdk-9+133jdk-9+133.tar.gz  jdk-9+133.zip  Gravatar J. Duke 4 years
jdk-9+132jdk-9+132.tar.gz  jdk-9+132.zip  Gravatar J. Duke 4 years
jdk-9+131jdk-9+131.tar.gz  jdk-9+131.zip  Gravatar J. Duke 4 years
jdk-9+130jdk-9+130.tar.gz  jdk-9+130.zip  Gravatar J. Duke 4 years
jdk-9+129jdk-9+129.tar.gz  jdk-9+129.zip  Gravatar J. Duke 4 years
jdk-9+128jdk-9+128.tar.gz  jdk-9+128.zip  Gravatar J. Duke 4 years
jdk-9+127jdk-9+127.tar.gz  jdk-9+127.zip  Gravatar J. Duke 4 years
jdk-9+126jdk-9+126.tar.gz  jdk-9+126.zip  Gravatar J. Duke 4 years
jdk-9+125jdk-9+125.tar.gz  jdk-9+125.zip  Gravatar J. Duke 4 years
jdk-9+124jdk-9+124.tar.gz  jdk-9+124.zip  Gravatar J. Duke 4 years
jdk-9+123jdk-9+123.tar.gz  jdk-9+123.zip  Gravatar J. Duke 4 years
jdk-9+122jdk-9+122.tar.gz  jdk-9+122.zip  Gravatar J. Duke 4 years
jdk-9+121jdk-9+121.tar.gz  jdk-9+121.zip  Gravatar J. Duke 4 years
jdk-9+120jdk-9+120.tar.gz  jdk-9+120.zip  Gravatar J. Duke 4 years
jdk-9+119jdk-9+119.tar.gz  jdk-9+119.zip  Gravatar J. Duke 4 years
jdk-9+118jdk-9+118.tar.gz  jdk-9+118.zip  Gravatar J. Duke 4 years
jdk-9+117jdk-9+117.tar.gz  jdk-9+117.zip  Gravatar J. Duke 4 years
jdk-9+116jdk-9+116.tar.gz  jdk-9+116.zip  Gravatar J. Duke 4 years
jdk-9+115jdk-9+115.tar.gz  jdk-9+115.zip  Gravatar J. Duke 4 years
jdk-9+114jdk-9+114.tar.gz  jdk-9+114.zip  Gravatar J. Duke 4 years
jdk-9+113jdk-9+113.tar.gz  jdk-9+113.zip  Gravatar J. Duke 4 years
jdk-9+112jdk-9+112.tar.gz  jdk-9+112.zip  Gravatar J. Duke 4 years
jdk-9+111jdk-9+111.tar.gz  jdk-9+111.zip  Gravatar J. Duke 4 years
jdk-9+110jdk-9+110.tar.gz  jdk-9+110.zip  Gravatar J. Duke 4 years
jdk-9+109jdk-9+109.tar.gz  jdk-9+109.zip  Gravatar J. Duke 4 years
jdk-9+108jdk-9+108.tar.gz  jdk-9+108.zip  Gravatar J. Duke 4 years
jdk-9+107jdk-9+107.tar.gz  jdk-9+107.zip  Gravatar J. Duke 4 years
jdk-9+106jdk-9+106.tar.gz  jdk-9+106.zip  Gravatar J. Duke 4 years
jdk-9+105jdk-9+105.tar.gz  jdk-9+105.zip  Gravatar J. Duke 4 years
jdk-9+104jdk-9+104.tar.gz  jdk-9+104.zip  Gravatar J. Duke 4 years
jdk-9+103jdk-9+103.tar.gz  jdk-9+103.zip  Gravatar J. Duke 4 years
jdk-9+102jdk-9+102.tar.gz  jdk-9+102.zip  Gravatar J. Duke 4 years
jdk-9+101jdk-9+101.tar.gz  jdk-9+101.zip  Gravatar J. Duke 4 years
jdk-9+100jdk-9+100.tar.gz  jdk-9+100.zip  Gravatar J. Duke 4 years
jdk-9+99jdk-9+99.tar.gz  jdk-9+99.zip  Gravatar J. Duke 4 years
jdk-9+98jdk-9+98.tar.gz  jdk-9+98.zip  Gravatar J. Duke 4 years
jdk-9+97jdk-9+97.tar.gz  jdk-9+97.zip  Gravatar J. Duke 4 years
jdk-9+96jdk-9+96.tar.gz  jdk-9+96.zip  Gravatar J. Duke 4 years
jdk-9+95jdk-9+95.tar.gz  jdk-9+95.zip  Gravatar J. Duke 4 years
jdk9-b94jdk9-b94.tar.gz  jdk9-b94.zip  Gravatar J. Duke 4 years
jdk9-b93jdk9-b93.tar.gz  jdk9-b93.zip  Gravatar J. Duke 4 years
jdk9-b92jdk9-b92.tar.gz  jdk9-b92.zip  Gravatar J. Duke 4 years
jdk9-b91jdk9-b91.tar.gz  jdk9-b91.zip  Gravatar J. Duke 4 years
jdk9-b90jdk9-b90.tar.gz  jdk9-b90.zip  Gravatar J. Duke 4 years
jdk9-b89jdk9-b89.tar.gz  jdk9-b89.zip  Gravatar J. Duke 4 years
jdk9-b88jdk9-b88.tar.gz  jdk9-b88.zip  Gravatar J. Duke 4 years
jdk9-b87jdk9-b87.tar.gz  jdk9-b87.zip  Gravatar J. Duke 4 years
jdk9-b86jdk9-b86.tar.gz  jdk9-b86.zip  Gravatar J. Duke 4 years
jdk9-b85jdk9-b85.tar.gz  jdk9-b85.zip  Gravatar J. Duke 4 years
jdk9-b84jdk9-b84.tar.gz  jdk9-b84.zip  Gravatar J. Duke 4 years
jdk9-b83jdk9-b83.tar.gz  jdk9-b83.zip  Gravatar J. Duke 4 years
jdk9-b82jdk9-b82.tar.gz  jdk9-b82.zip  Gravatar J. Duke 4 years
jdk9-b81jdk9-b81.tar.gz  jdk9-b81.zip  Gravatar J. Duke 4 years
jdk9-b80jdk9-b80.tar.gz  jdk9-b80.zip  Gravatar J. Duke 4 years
jdk9-b79jdk9-b79.tar.gz  jdk9-b79.zip  Gravatar J. Duke 4 years
jdk9-b78jdk9-b78.tar.gz  jdk9-b78.zip  Gravatar J. Duke 4 years
jdk9-b77jdk9-b77.tar.gz  jdk9-b77.zip  Gravatar J. Duke 4 years
jdk9-b76jdk9-b76.tar.gz  jdk9-b76.zip  Gravatar J. Duke 4 years
jdk9-b75jdk9-b75.tar.gz  jdk9-b75.zip  Gravatar J. Duke 4 years
jdk9-b74jdk9-b74.tar.gz  jdk9-b74.zip  Gravatar J. Duke 4 years
jdk9-b73jdk9-b73.tar.gz  jdk9-b73.zip  Gravatar J. Duke 4 years
jdk9-b72jdk9-b72.tar.gz  jdk9-b72.zip  Gravatar J. Duke 4 years
jdk9-b71jdk9-b71.tar.gz  jdk9-b71.zip  Gravatar J. Duke 4 years
jdk9-b70jdk9-b70.tar.gz  jdk9-b70.zip  Gravatar J. Duke 4 years
jdk9-b69jdk9-b69.tar.gz  jdk9-b69.zip  Gravatar J. Duke 4 years
jdk9-b68jdk9-b68.tar.gz  jdk9-b68.zip  Gravatar J. Duke 4 years
jdk9-b67jdk9-b67.tar.gz  jdk9-b67.zip  Gravatar J. Duke 4 years
jdk9-b66jdk9-b66.tar.gz  jdk9-b66.zip  Gravatar J. Duke 4 years
jdk9-b65jdk9-b65.tar.gz  jdk9-b65.zip  Gravatar J. Duke 4 years
jdk9-b64jdk9-b64.tar.gz  jdk9-b64.zip  Gravatar J. Duke 4 years
jdk9-b63jdk9-b63.tar.gz  jdk9-b63.zip  Gravatar J. Duke 4 years
jdk9-b62jdk9-b62.tar.gz  jdk9-b62.zip  Gravatar J. Duke 4 years
jdk9-b61jdk9-b61.tar.gz  jdk9-b61.zip  Gravatar J. Duke 4 years
jdk9-b60jdk9-b60.tar.gz  jdk9-b60.zip  Gravatar J. Duke 4 years
jdk9-b59jdk9-b59.tar.gz  jdk9-b59.zip  Gravatar J. Duke 4 years
jdk9-b58jdk9-b58.tar.gz  jdk9-b58.zip  Gravatar J. Duke 4 years
jdk9-b57jdk9-b57.tar.gz  jdk9-b57.zip  Gravatar J. Duke 4 years
jdk9-b56jdk9-b56.tar.gz  jdk9-b56.zip  Gravatar J. Duke 4 years
jdk9-b55jdk9-b55.tar.gz  jdk9-b55.zip  Gravatar J. Duke 4 years
jdk9-b54jdk9-b54.tar.gz  jdk9-b54.zip  Gravatar J. Duke 4 years
jdk9-b53jdk9-b53.tar.gz  jdk9-b53.zip  Gravatar J. Duke 4 years
jdk9-b52jdk9-b52.tar.gz  jdk9-b52.zip  Gravatar J. Duke 4 years
jdk9-b51jdk9-b51.tar.gz  jdk9-b51.zip  Gravatar J. Duke 4 years
jdk9-b50jdk9-b50.tar.gz  jdk9-b50.zip  Gravatar J. Duke 4 years
jdk9-b49jdk9-b49.tar.gz  jdk9-b49.zip  Gravatar J. Duke 4 years
jdk9-b48jdk9-b48.tar.gz  jdk9-b48.zip  Gravatar J. Duke 4 years
jdk9-b47jdk9-b47.tar.gz  jdk9-b47.zip  Gravatar J. Duke 4 years
jdk9-b46jdk9-b46.tar.gz  jdk9-b46.zip  Gravatar J. Duke 4 years
jdk9-b45jdk9-b45.tar.gz  jdk9-b45.zip  Gravatar J. Duke 4 years
jdk9-b44jdk9-b44.tar.gz  jdk9-b44.zip  Gravatar J. Duke 4 years
jdk9-b43jdk9-b43.tar.gz  jdk9-b43.zip  Gravatar J. Duke 4 years
jdk9-b42jdk9-b42.tar.gz  jdk9-b42.zip  Gravatar J. Duke 4 years
jdk9-b41jdk9-b41.tar.gz  jdk9-b41.zip  Gravatar J. Duke 4 years
jdk9-b40jdk9-b40.tar.gz  jdk9-b40.zip  Gravatar J. Duke 4 years
jdk9-b39jdk9-b39.tar.gz  jdk9-b39.zip  Gravatar J. Duke 4 years
jdk9-b38jdk9-b38.tar.gz  jdk9-b38.zip  Gravatar J. Duke 4 years
jdk9-b37jdk9-b37.tar.gz  jdk9-b37.zip  Gravatar J. Duke 4 years
jdk9-b36jdk9-b36.tar.gz  jdk9-b36.zip  Gravatar J. Duke 4 years
jdk9-b35jdk9-b35.tar.gz  jdk9-b35.zip  Gravatar J. Duke 4 years
jdk9-b34jdk9-b34.tar.gz  jdk9-b34.zip  Gravatar J. Duke 4 years
jdk9-b33jdk9-b33.tar.gz  jdk9-b33.zip  Gravatar J. Duke 4 years
jdk9-b32jdk9-b32.tar.gz  jdk9-b32.zip  Gravatar J. Duke 4 years
jdk9-b31jdk9-b31.tar.gz  jdk9-b31.zip  Gravatar J. Duke 4 years
jdk9-b30jdk9-b30.tar.gz  jdk9-b30.zip  Gravatar J. Duke 4 years
jdk9-b29jdk9-b29.tar.gz  jdk9-b29.zip  Gravatar J. Duke 4 years
jdk9-b28jdk9-b28.tar.gz  jdk9-b28.zip  Gravatar J. Duke 4 years
jdk9-b27jdk9-b27.tar.gz  jdk9-b27.zip  Gravatar J. Duke 4 years
jdk9-b26jdk9-b26.tar.gz  jdk9-b26.zip  Gravatar J. Duke 4 years
jdk9-b25jdk9-b25.tar.gz  jdk9-b25.zip  Gravatar J. Duke 4 years
jdk9-b24jdk9-b24.tar.gz  jdk9-b24.zip  Gravatar J. Duke 4 years
jdk9-b23jdk9-b23.tar.gz  jdk9-b23.zip  Gravatar J. Duke 4 years
jdk9-b22jdk9-b22.tar.gz  jdk9-b22.zip  Gravatar J. Duke 4 years
jdk9-b21jdk9-b21.tar.gz  jdk9-b21.zip  Gravatar J. Duke 4 years
jdk9-b20jdk9-b20.tar.gz  jdk9-b20.zip  Gravatar J. Duke 4 years
jdk9-b19jdk9-b19.tar.gz  jdk9-b19.zip  Gravatar J. Duke 4 years
jdk9-b18jdk9-b18.tar.gz  jdk9-b18.zip  Gravatar J. Duke 4 years
jdk9-b17jdk9-b17.tar.gz  jdk9-b17.zip  Gravatar J. Duke 4 years
jdk9-b16jdk9-b16.tar.gz  jdk9-b16.zip  Gravatar J. Duke 4 years
jdk9-b15jdk9-b15.tar.gz  jdk9-b15.zip  Gravatar J. Duke 4 years
jdk9-b14jdk9-b14.tar.gz  jdk9-b14.zip  Gravatar J. Duke 4 years
jdk9-b13jdk9-b13.tar.gz  jdk9-b13.zip  Gravatar J. Duke 4 years
jdk9-b12jdk9-b12.tar.gz  jdk9-b12.zip  Gravatar J. Duke 4 years
jdk9-b11jdk9-b11.tar.gz  jdk9-b11.zip  Gravatar J. Duke 4 years
jdk9-b10jdk9-b10.tar.gz  jdk9-b10.zip  Gravatar J. Duke 4 years
jdk9-b09jdk9-b09.tar.gz  jdk9-b09.zip  Gravatar J. Duke 4 years
jdk9-b08jdk9-b08.tar.gz  jdk9-b08.zip  Gravatar J. Duke 4 years
jdk9-b07jdk9-b07.tar.gz  jdk9-b07.zip  Gravatar J. Duke 4 years
jdk9-b06jdk9-b06.tar.gz  jdk9-b06.zip  Gravatar J. Duke 4 years
jdk9-b05jdk9-b05.tar.gz  jdk9-b05.zip  Gravatar J. Duke 4 years
jdk9-b04jdk9-b04.tar.gz  jdk9-b04.zip  Gravatar J. Duke 4 years
jdk9-b03jdk9-b03.tar.gz  jdk9-b03.zip  Gravatar J. Duke 4 years
jdk9-b02jdk9-b02.tar.gz  jdk9-b02.zip  Gravatar J. Duke 4 years
jdk9-b01jdk9-b01.tar.gz  jdk9-b01.zip  Gravatar J. Duke 4 years
jdk9-b00jdk9-b00.tar.gz  jdk9-b00.zip  Gravatar J. Duke 4 years
jdk8-b120jdk8-b120.tar.gz  jdk8-b120.zip  Gravatar J. Duke 4 years
jdk8-b119jdk8-b119.tar.gz  jdk8-b119.zip  Gravatar J. Duke 4 years
jdk8-b118jdk8-b118.tar.gz  jdk8-b118.zip  Gravatar J. Duke 4 years
jdk8-b117jdk8-b117.tar.gz  jdk8-b117.zip  Gravatar J. Duke 4 years
jdk8-b116jdk8-b116.tar.gz  jdk8-b116.zip  Gravatar J. Duke 4 years
jdk8-b115jdk8-b115.tar.gz  jdk8-b115.zip  Gravatar J. Duke 4 years
jdk8-b114jdk8-b114.tar.gz  jdk8-b114.zip  Gravatar J. Duke 4 years
jdk8-b113jdk8-b113.tar.gz  jdk8-b113.zip  Gravatar J. Duke 4 years
jdk8-b112jdk8-b112.tar.gz  jdk8-b112.zip  Gravatar J. Duke 4 years
jdk8-b111jdk8-b111.tar.gz  jdk8-b111.zip  Gravatar J. Duke 4 years
jdk8-b110jdk8-b110.tar.gz  jdk8-b110.zip  Gravatar J. Duke 4 years
jdk8-b109jdk8-b109.tar.gz  jdk8-b109.zip  Gravatar J. Duke 4 years
jdk8-b108jdk8-b108.tar.gz  jdk8-b108.zip  Gravatar J. Duke 4 years
jdk8-b107jdk8-b107.tar.gz  jdk8-b107.zip  Gravatar J. Duke 4 years
jdk8-b106jdk8-b106.tar.gz  jdk8-b106.zip  Gravatar J. Duke 4 years
jdk8-b105jdk8-b105.tar.gz  jdk8-b105.zip  Gravatar J. Duke 4 years
jdk8-b104jdk8-b104.tar.gz  jdk8-b104.zip  Gravatar J. Duke 4 years
jdk8-b103jdk8-b103.tar.gz  jdk8-b103.zip  Gravatar J. Duke 4 years
jdk8-b102jdk8-b102.tar.gz  jdk8-b102.zip  Gravatar J. Duke 4 years
jdk8-b101jdk8-b101.tar.gz  jdk8-b101.zip  Gravatar J. Duke 4 years
jdk8-b100jdk8-b100.tar.gz  jdk8-b100.zip  Gravatar J. Duke 4 years
jdk8-b99jdk8-b99.tar.gz  jdk8-b99.zip  Gravatar J. Duke 4 years
jdk8-b98jdk8-b98.tar.gz  jdk8-b98.zip  Gravatar J. Duke 4 years
jdk8-b97jdk8-b97.tar.gz  jdk8-b97.zip  Gravatar J. Duke 4 years
jdk8-b96jdk8-b96.tar.gz  jdk8-b96.zip  Gravatar J. Duke 4 years
jdk8-b95jdk8-b95.tar.gz  jdk8-b95.zip  Gravatar J. Duke 4 years
jdk8-b94jdk8-b94.tar.gz  jdk8-b94.zip  Gravatar J. Duke 4 years
jdk8-b93jdk8-b93.tar.gz  jdk8-b93.zip  Gravatar J. Duke 4 years
jdk8-b92jdk8-b92.tar.gz  jdk8-b92.zip  Gravatar J. Duke 4 years
jdk8-b91jdk8-b91.tar.gz  jdk8-b91.zip  Gravatar J. Duke 4 years
jdk8-b90jdk8-b90.tar.gz  jdk8-b90.zip  Gravatar J. Duke 4 years
jdk8-b89jdk8-b89.tar.gz  jdk8-b89.zip  Gravatar J. Duke 4 years
jdk8-b88jdk8-b88.tar.gz  jdk8-b88.zip  Gravatar J. Duke 4 years
jdk8-b87jdk8-b87.tar.gz  jdk8-b87.zip  Gravatar J. Duke 4 years
jdk8-b86jdk8-b86.tar.gz  jdk8-b86.zip  Gravatar J. Duke 4 years
jdk8-b85jdk8-b85.tar.gz  jdk8-b85.zip  Gravatar J. Duke 4 years
jdk8-b84jdk8-b84.tar.gz  jdk8-b84.zip  Gravatar J. Duke 4 years
jdk8-b83jdk8-b83.tar.gz  jdk8-b83.zip  Gravatar J. Duke 4 years
jdk8-b82jdk8-b82.tar.gz  jdk8-b82.zip  Gravatar J. Duke 4 years
jdk8-b81jdk8-b81.tar.gz  jdk8-b81.zip  Gravatar J. Duke 4 years
jdk8-b80jdk8-b80.tar.gz  jdk8-b80.zip  Gravatar J. Duke 4 years
jdk8-b79jdk8-b79.tar.gz  jdk8-b79.zip  Gravatar J. Duke 4 years
jdk8-b78jdk8-b78.tar.gz  jdk8-b78.zip  Gravatar J. Duke 4 years
jdk8-b77jdk8-b77.tar.gz  jdk8-b77.zip  Gravatar J. Duke 4 years
jdk8-b76jdk8-b76.tar.gz  jdk8-b76.zip  Gravatar J. Duke 4 years
jdk8-b75jdk8-b75.tar.gz  jdk8-b75.zip  Gravatar J. Duke 4 years
jdk8-b74jdk8-b74.tar.gz  jdk8-b74.zip  Gravatar J. Duke 4 years
jdk8-b73jdk8-b73.tar.gz  jdk8-b73.zip  Gravatar J. Duke 4 years
jdk8-b72jdk8-b72.tar.gz  jdk8-b72.zip  Gravatar J. Duke 4 years
jdk8-b71jdk8-b71.tar.gz  jdk8-b71.zip  Gravatar J. Duke 4 years
jdk8-b70jdk8-b70.tar.gz  jdk8-b70.zip  Gravatar J. Duke 4 years
jdk8-b69jdk8-b69.tar.gz  jdk8-b69.zip  Gravatar J. Duke 4 years
jdk8-b68jdk8-b68.tar.gz  jdk8-b68.zip  Gravatar J. Duke 4 years
jdk8-b67jdk8-b67.tar.gz  jdk8-b67.zip  Gravatar J. Duke 4 years
jdk8-b66jdk8-b66.tar.gz  jdk8-b66.zip  Gravatar J. Duke 4 years
jdk8-b65jdk8-b65.tar.gz  jdk8-b65.zip  Gravatar J. Duke 4 years
jdk8-b64jdk8-b64.tar.gz  jdk8-b64.zip  Gravatar J. Duke 4 years
jdk8-b63jdk8-b63.tar.gz  jdk8-b63.zip  Gravatar J. Duke 4 years
jdk8-b62jdk8-b62.tar.gz  jdk8-b62.zip  Gravatar J. Duke 4 years
jdk8-b61jdk8-b61.tar.gz  jdk8-b61.zip  Gravatar J. Duke 4 years
jdk8-b60jdk8-b60.tar.gz  jdk8-b60.zip  Gravatar J. Duke 4 years
jdk8-b59jdk8-b59.tar.gz  jdk8-b59.zip  Gravatar J. Duke 4 years
jdk8-b58jdk8-b58.tar.gz  jdk8-b58.zip  Gravatar J. Duke 4 years
jdk8-b57jdk8-b57.tar.gz  jdk8-b57.zip  Gravatar J. Duke 4 years
jdk8-b56jdk8-b56.tar.gz  jdk8-b56.zip  Gravatar J. Duke 4 years
jdk8-b55jdk8-b55.tar.gz  jdk8-b55.zip  Gravatar J. Duke 4 years
jdk8-b54jdk8-b54.tar.gz  jdk8-b54.zip  Gravatar J. Duke 4 years
jdk8-b53jdk8-b53.tar.gz  jdk8-b53.zip  Gravatar J. Duke 4 years
jdk8-b52jdk8-b52.tar.gz  jdk8-b52.zip  Gravatar J. Duke 4 years
jdk8-b51jdk8-b51.tar.gz  jdk8-b51.zip  Gravatar J. Duke 4 years
jdk8-b50jdk8-b50.tar.gz  jdk8-b50.zip  Gravatar J. Duke 4 years
jdk8-b49jdk8-b49.tar.gz  jdk8-b49.zip  Gravatar J. Duke 4 years
jdk8-b48jdk8-b48.tar.gz  jdk8-b48.zip  Gravatar J. Duke 4 years
jdk8-b47jdk8-b47.tar.gz  jdk8-b47.zip  Gravatar J. Duke 4 years
jdk8-b46jdk8-b46.tar.gz  jdk8-b46.zip  Gravatar J. Duke 4 years
jdk8-b45jdk8-b45.tar.gz  jdk8-b45.zip  Gravatar J. Duke 4 years
jdk8-b44jdk8-b44.tar.gz  jdk8-b44.zip  Gravatar J. Duke 4 years
jdk8-b43jdk8-b43.tar.gz  jdk8-b43.zip  Gravatar J. Duke 4 years
jdk8-b42jdk8-b42.tar.gz  jdk8-b42.zip  Gravatar J. Duke 4 years
jdk8-b41jdk8-b41.tar.gz  jdk8-b41.zip  Gravatar J. Duke 4 years
jdk8-b40jdk8-b40.tar.gz  jdk8-b40.zip  Gravatar J. Duke 4 years
jdk8-b39jdk8-b39.tar.gz  jdk8-b39.zip  Gravatar J. Duke 4 years
jdk8-b38jdk8-b38.tar.gz  jdk8-b38.zip  Gravatar J. Duke 4 years
jdk8-b37jdk8-b37.tar.gz  jdk8-b37.zip  Gravatar J. Duke 4 years
jdk8-b36jdk8-b36.tar.gz  jdk8-b36.zip  Gravatar J. Duke 4 years
jdk8-b35jdk8-b35.tar.gz  jdk8-b35.zip  Gravatar J. Duke 4 years
jdk8-b34jdk8-b34.tar.gz  jdk8-b34.zip  Gravatar J. Duke 4 years
jdk8-b33jdk8-b33.tar.gz  jdk8-b33.zip  Gravatar J. Duke 4 years
jdk8-b32jdk8-b32.tar.gz  jdk8-b32.zip  Gravatar J. Duke 4 years
jdk8-b31jdk8-b31.tar.gz  jdk8-b31.zip  Gravatar J. Duke 4 years
jdk8-b30jdk8-b30.tar.gz  jdk8-b30.zip  Gravatar J. Duke 4 years
jdk8-b29jdk8-b29.tar.gz  jdk8-b29.zip  Gravatar J. Duke 4 years
jdk8-b28jdk8-b28.tar.gz  jdk8-b28.zip  Gravatar J. Duke 4 years
jdk8-b27jdk8-b27.tar.gz  jdk8-b27.zip  Gravatar J. Duke 4 years
jdk8-b26jdk8-b26.tar.gz  jdk8-b26.zip  Gravatar J. Duke 4 years
jdk8-b25jdk8-b25.tar.gz  jdk8-b25.zip  Gravatar J. Duke 4 years
jdk8-b24jdk8-b24.tar.gz  jdk8-b24.zip  Gravatar J. Duke 4 years
jdk8-b23jdk8-b23.tar.gz  jdk8-b23.zip  Gravatar J. Duke 4 years
jdk8-b22jdk8-b22.tar.gz  jdk8-b22.zip  Gravatar J. Duke 4 years
jdk8-b21jdk8-b21.tar.gz  jdk8-b21.zip  Gravatar J. Duke 4 years
jdk8-b20jdk8-b20.tar.gz  jdk8-b20.zip  Gravatar J. Duke 4 years
jdk8-b19jdk8-b19.tar.gz  jdk8-b19.zip  Gravatar J. Duke 4 years
jdk8-b18jdk8-b18.tar.gz  jdk8-b18.zip  Gravatar J. Duke 4 years
jdk8-b17jdk8-b17.tar.gz  jdk8-b17.zip  Gravatar J. Duke 4 years
jdk8-b16jdk8-b16.tar.gz  jdk8-b16.zip  Gravatar J. Duke 4 years
jdk8-b15jdk8-b15.tar.gz  jdk8-b15.zip  Gravatar J. Duke 4 years
jdk8-b14jdk8-b14.tar.gz  jdk8-b14.zip  Gravatar J. Duke 4 years
jdk8-b13jdk8-b13.tar.gz  jdk8-b13.zip  Gravatar J. Duke 4 years
jdk8-b12jdk8-b12.tar.gz  jdk8-b12.zip  Gravatar J. Duke 4 years
jdk8-b11jdk8-b11.tar.gz  jdk8-b11.zip  Gravatar J. Duke 4 years
jdk8-b10jdk8-b10.tar.gz  jdk8-b10.zip  Gravatar J. Duke 4 years
jdk8-b09jdk8-b09.tar.gz  jdk8-b09.zip  Gravatar J. Duke 4 years
jdk8-b08jdk8-b08.tar.gz  jdk8-b08.zip  Gravatar J. Duke 4 years
jdk8-b07jdk8-b07.tar.gz  jdk8-b07.zip  Gravatar J. Duke 4 years
jdk8-b06jdk8-b06.tar.gz  jdk8-b06.zip  Gravatar J. Duke 4 years
jdk8-b05jdk8-b05.tar.gz  jdk8-b05.zip  Gravatar J. Duke 4 years
jdk8-b04jdk8-b04.tar.gz  jdk8-b04.zip  Gravatar J. Duke 4 years
jdk8-b03jdk8-b03.tar.gz  jdk8-b03.zip  Gravatar J. Duke 4 years
jdk8-b02jdk8-b02.tar.gz  jdk8-b02.zip  Gravatar J. Duke 4 years
jdk8-b01jdk8-b01.tar.gz  jdk8-b01.zip  Gravatar J. Duke 4 years
jdk7-b147jdk7-b147.tar.gz  jdk7-b147.zip  Gravatar J. Duke 4 years
jdk7-b146jdk7-b146.tar.gz  jdk7-b146.zip  Gravatar J. Duke 4 years
jdk7-b145jdk7-b145.tar.gz  jdk7-b145.zip  Gravatar J. Duke 4 years
jdk7-b144jdk7-b144.tar.gz  jdk7-b144.zip  Gravatar J. Duke 4 years
jdk7-b143jdk7-b143.tar.gz  jdk7-b143.zip  Gravatar J. Duke 4 years
jdk7-b142jdk7-b142.tar.gz  jdk7-b142.zip  Gravatar J. Duke 4 years
jdk7-b141jdk7-b141.tar.gz  jdk7-b141.zip  Gravatar J. Duke 4 years
jdk7-b140jdk7-b140.tar.gz  jdk7-b140.zip  Gravatar J. Duke 4 years
jdk7-b139jdk7-b139.tar.gz  jdk7-b139.zip  Gravatar J. Duke 4 years
jdk7-b138jdk7-b138.tar.gz  jdk7-b138.zip  Gravatar J. Duke 4 years
jdk7-b137jdk7-b137.tar.gz  jdk7-b137.zip  Gravatar J. Duke 4 years
jdk7-b136jdk7-b136.tar.gz  jdk7-b136.zip  Gravatar J. Duke 4 years
jdk7-b135jdk7-b135.tar.gz  jdk7-b135.zip  Gravatar J. Duke 4 years
jdk7-b134jdk7-b134.tar.gz  jdk7-b134.zip  Gravatar J. Duke 4 years
jdk7-b133jdk7-b133.tar.gz  jdk7-b133.zip  Gravatar J. Duke 4 years
jdk7-b132jdk7-b132.tar.gz  jdk7-b132.zip  Gravatar J. Duke 4 years
jdk7-b131jdk7-b131.tar.gz  jdk7-b131.zip  Gravatar J. Duke 4 years
jdk7-b130jdk7-b130.tar.gz  jdk7-b130.zip  Gravatar J. Duke 4 years
jdk7-b129jdk7-b129.tar.gz  jdk7-b129.zip  Gravatar J. Duke 4 years
jdk7-b128jdk7-b128.tar.gz  jdk7-b128.zip  Gravatar J. Duke 4 years
jdk7-b127jdk7-b127.tar.gz  jdk7-b127.zip  Gravatar J. Duke 4 years
jdk7-b126jdk7-b126.tar.gz  jdk7-b126.zip  Gravatar J. Duke 4 years
jdk7-b125jdk7-b125.tar.gz  jdk7-b125.zip  Gravatar J. Duke 4 years
jdk7-b124jdk7-b124.tar.gz  jdk7-b124.zip  Gravatar J. Duke 4 years
jdk7-b123jdk7-b123.tar.gz  jdk7-b123.zip  Gravatar J. Duke 4 years
jdk7-b122jdk7-b122.tar.gz  jdk7-b122.zip  Gravatar J. Duke 4 years
jdk7-b121jdk7-b121.tar.gz  jdk7-b121.zip  Gravatar J. Duke 4 years
jdk7-b120jdk7-b120.tar.gz  jdk7-b120.zip  Gravatar J. Duke 4 years
jdk7-b119jdk7-b119.tar.gz  jdk7-b119.zip  Gravatar J. Duke 4 years
jdk7-b118jdk7-b118.tar.gz  jdk7-b118.zip  Gravatar J. Duke 4 years
jdk7-b117jdk7-b117.tar.gz  jdk7-b117.zip  Gravatar J. Duke 4 years
jdk7-b116jdk7-b116.tar.gz  jdk7-b116.zip  Gravatar J. Duke 4 years
jdk7-b115jdk7-b115.tar.gz  jdk7-b115.zip  Gravatar J. Duke 4 years
jdk7-b114jdk7-b114.tar.gz  jdk7-b114.zip  Gravatar J. Duke 4 years
jdk7-b113jdk7-b113.tar.gz  jdk7-b113.zip  Gravatar J. Duke 4 years
jdk7-b112jdk7-b112.tar.gz  jdk7-b112.zip  Gravatar J. Duke 4 years
jdk7-b111jdk7-b111.tar.gz  jdk7-b111.zip  Gravatar J. Duke 4 years
jdk7-b110jdk7-b110.tar.gz  jdk7-b110.zip  Gravatar J. Duke 4 years
jdk7-b109jdk7-b109.tar.gz  jdk7-b109.zip  Gravatar J. Duke 4 years
jdk7-b108jdk7-b108.tar.gz  jdk7-b108.zip  Gravatar J. Duke 4 years
jdk7-b107jdk7-b107.tar.gz  jdk7-b107.zip  Gravatar J. Duke 4 years
jdk7-b106jdk7-b106.tar.gz  jdk7-b106.zip  Gravatar J. Duke 4 years
jdk7-b105jdk7-b105.tar.gz  jdk7-b105.zip  Gravatar J. Duke 4 years
jdk7-b104jdk7-b104.tar.gz  jdk7-b104.zip  Gravatar J. Duke 4 years
jdk7-b103jdk7-b103.tar.gz  jdk7-b103.zip  Gravatar J. Duke 4 years
jdk7-b102jdk7-b102.tar.gz  jdk7-b102.zip  Gravatar J. Duke 4 years
jdk7-b101jdk7-b101.tar.gz  jdk7-b101.zip  Gravatar J. Duke 4 years
jdk7-b100jdk7-b100.tar.gz  jdk7-b100.zip  Gravatar J. Duke 4 years
jdk7-b99jdk7-b99.tar.gz  jdk7-b99.zip  Gravatar J. Duke 4 years
jdk7-b98jdk7-b98.tar.gz  jdk7-b98.zip  Gravatar J. Duke 4 years
jdk7-b97jdk7-b97.tar.gz  jdk7-b97.zip  Gravatar J. Duke 4 years
jdk7-b96jdk7-b96.tar.gz  jdk7-b96.zip  Gravatar J. Duke 4 years
jdk7-b95jdk7-b95.tar.gz  jdk7-b95.zip  Gravatar J. Duke 4 years
jdk7-b94jdk7-b94.tar.gz  jdk7-b94.zip  Gravatar J. Duke 4 years
jdk7-b93jdk7-b93.tar.gz  jdk7-b93.zip  Gravatar J. Duke 4 years
jdk7-b92jdk7-b92.tar.gz  jdk7-b92.zip  Gravatar J. Duke 4 years
jdk7-b91jdk7-b91.tar.gz  jdk7-b91.zip  Gravatar J. Duke 4 years
jdk7-b90jdk7-b90.tar.gz  jdk7-b90.zip  Gravatar J. Duke 4 years
jdk7-b89jdk7-b89.tar.gz  jdk7-b89.zip  Gravatar J. Duke 4 years
jdk7-b88jdk7-b88.tar.gz  jdk7-b88.zip  Gravatar J. Duke 4 years
jdk7-b87jdk7-b87.tar.gz  jdk7-b87.zip  Gravatar J. Duke 4 years
jdk7-b86jdk7-b86.tar.gz  jdk7-b86.zip  Gravatar J. Duke 4 years
jdk7-b85jdk7-b85.tar.gz  jdk7-b85.zip  Gravatar J. Duke 4 years
jdk7-b84jdk7-b84.tar.gz  jdk7-b84.zip  Gravatar J. Duke 4 years
jdk7-b83jdk7-b83.tar.gz  jdk7-b83.zip  Gravatar J. Duke 4 years
jdk7-b82jdk7-b82.tar.gz  jdk7-b82.zip  Gravatar J. Duke 4 years
jdk7-b81jdk7-b81.tar.gz  jdk7-b81.zip  Gravatar J. Duke 4 years
jdk7-b80jdk7-b80.tar.gz  jdk7-b80.zip  Gravatar J. Duke 4 years
jdk7-b79jdk7-b79.tar.gz  jdk7-b79.zip  Gravatar J. Duke 4 years
jdk7-b78jdk7-b78.tar.gz  jdk7-b78.zip  Gravatar J. Duke 4 years
jdk7-b77jdk7-b77.tar.gz  jdk7-b77.zip  Gravatar J. Duke 4 years
jdk7-b76jdk7-b76.tar.gz  jdk7-b76.zip  Gravatar J. Duke 4 years
jdk7-b75jdk7-b75.tar.gz  jdk7-b75.zip  Gravatar J. Duke 4 years
jdk7-b74jdk7-b74.tar.gz  jdk7-b74.zip  Gravatar J. Duke 4 years
jdk7-b73jdk7-b73.tar.gz  jdk7-b73.zip  Gravatar J. Duke 4 years
jdk7-b72jdk7-b72.tar.gz  jdk7-b72.zip  Gravatar J. Duke 4 years
jdk7-b71jdk7-b71.tar.gz  jdk7-b71.zip  Gravatar J. Duke 4 years
jdk7-b70jdk7-b70.tar.gz  jdk7-b70.zip  Gravatar J. Duke 4 years
jdk7-b69jdk7-b69.tar.gz  jdk7-b69.zip  Gravatar J. Duke 4 years
jdk7-b68jdk7-b68.tar.gz  jdk7-b68.zip  Gravatar J. Duke 4 years
jdk7-b67jdk7-b67.tar.gz  jdk7-b67.zip  Gravatar J. Duke 4 years
jdk7-b66jdk7-b66.tar.gz  jdk7-b66.zip  Gravatar J. Duke 4 years
jdk7-b65jdk7-b65.tar.gz  jdk7-b65.zip  Gravatar J. Duke 4 years
jdk7-b64jdk7-b64.tar.gz  jdk7-b64.zip  Gravatar J. Duke 4 years
jdk7-b63jdk7-b63.tar.gz  jdk7-b63.zip  Gravatar J. Duke 4 years
jdk7-b62jdk7-b62.tar.gz  jdk7-b62.zip  Gravatar J. Duke 4 years
jdk7-b61jdk7-b61.tar.gz  jdk7-b61.zip  Gravatar J. Duke 4 years
jdk7-b60jdk7-b60.tar.gz  jdk7-b60.zip  Gravatar J. Duke 4 years
jdk7-b59jdk7-b59.tar.gz  jdk7-b59.zip  Gravatar J. Duke 4 years
jdk7-b58jdk7-b58.tar.gz  jdk7-b58.zip  Gravatar J. Duke 4 years
jdk7-b57jdk7-b57.tar.gz  jdk7-b57.zip  Gravatar J. Duke 4 years
jdk7-b56jdk7-b56.tar.gz  jdk7-b56.zip  Gravatar J. Duke 4 years
jdk7-b55jdk7-b55.tar.gz  jdk7-b55.zip  Gravatar J. Duke 4 years
jdk7-b54jdk7-b54.tar.gz  jdk7-b54.zip  Gravatar J. Duke 4 years
jdk7-b53jdk7-b53.tar.gz  jdk7-b53.zip  Gravatar J. Duke 4 years
jdk7-b52jdk7-b52.tar.gz  jdk7-b52.zip  Gravatar J. Duke 4 years
jdk7-b51jdk7-b51.tar.gz  jdk7-b51.zip  Gravatar J. Duke 4 years
jdk7-b50jdk7-b50.tar.gz  jdk7-b50.zip  Gravatar J. Duke 4 years
jdk7-b49jdk7-b49.tar.gz  jdk7-b49.zip  Gravatar J. Duke 4 years
jdk7-b48jdk7-b48.tar.gz  jdk7-b48.zip  Gravatar J. Duke 4 years
jdk7-b47jdk7-b47.tar.gz  jdk7-b47.zip  Gravatar J. Duke 4 years
jdk7-b46jdk7-b46.tar.gz  jdk7-b46.zip  Gravatar J. Duke 4 years
jdk7-b45jdk7-b45.tar.gz  jdk7-b45.zip  Gravatar J. Duke 4 years
jdk7-b44jdk7-b44.tar.gz  jdk7-b44.zip  Gravatar J. Duke 4 years
jdk7-b43jdk7-b43.tar.gz  jdk7-b43.zip  Gravatar J. Duke 4 years
jdk7-b42jdk7-b42.tar.gz  jdk7-b42.zip  Gravatar J. Duke 4 years
jdk7-b41jdk7-b41.tar.gz  jdk7-b41.zip